The BIM4Ren buildings ontology
type: Ontology
version IRI: https://models.bim4ren.eu/buildings/0.1
imports: property#
imports: bot
contributor: Nathalie Charbel
contributor: Pierre Bourreau
description: The buildings ontology is part of the BIM4Ren project. It belongs to the core layer, and is an extension of the BOT ontology (Building Ontology Topology). Additional concepts are the possibility to describe a building enveloppe, and to classify buildings and rooms according to their usage.

Appartment
type: Class
subclass of: VolumetricZone
subclass of: Zone
disjoint with: Building
disjoint with: Site
disjoint with: Space
disjoint with: Storey
label: Appartement @fr

Attic
type: Class
subclass of: Space
comment: The space between the ceiling beams of the top story and the roof rafters.
is defined by: Omniclass 13-23 23 27

Bathroom
type: Class
subclass of: Space
comment: Space for washing one's body or part of it.
is defined by: Omniclass 13-65 13 15

CirculationSpace
type: Class
subclass of: Space
comment: Spaces for circulation that provide or control access to and between other spaces within the facility, entry, and egress.
is defined by: Omniclass 13-25 00 00

Condominum
type: Class
subclass of: Multi-Dwelling Housing
is defined by: Part of 'Duplex' in Omniclass 11 (2013 02 26)

DiningRoom
type: Class
subclass of: Space
comment: A room in a home or hotel, or a private area in a restaurant away from the main public area, where meals are eaten.
is defined by: Omniclass 13-57 13 15 11

Dormitory
type: Class
subclass of: Residential Building
comment: A single facility containing multiple sleeping quarters and typically shared eating and lavatory facilities typically for students.
label: Dortoir @fr

Enveloppe
type: Class
label: Envolvente de edificación @es
label: Involucro edilizio @it

Garage
type: Class
subclass of: Space
comment: Totally or partially enclosed space that is normally used to circulate and station vehicles.
is defined by: Omniclass 13-21 13 00

Government Subsidized Building
type: Class
subclass of: Multi-Dwelling Housing
comment: A dwelling (or dwellings) that has a lowered cost of ownership due to government funding and support.
is defined by: 'Government Subsiduzed Building' in Omniclass 11 (2013 02 26)

Kitchen
type: Class
subclass of: Space
comment: A room or part of a room used for cooking and food preparation.
is defined by: Omniclass 13-65 23 00

LivingRoom
type: Class
subclass of: Space
comment: A room in a home or hotel, or a private area in a restaurant away from the main public area, where meals are eaten.
is defined by: Omniclass 13-57 13 15 11

Multi-Dwelling Housing
type: Class
subclass of: Residential Building
comment: Multiple dwellings contained in a single structure.
is defined by: 'Multiple Family Residences' in Omniclass 11 (2013 02 26)

Residential Building
type: Class
subclass of: Building
comment: Facilities used for long-term inhabitation and dwelling by humans.
is defined by: 'Housing Facility' in Omniclass 11 (2013 02 26)
label: Bâtiment résidentiel @fr

SeniorHousing
type: Class
subclass of: Residential Building
comment: Dwellings and commercial facilities designed and/or retrofitted for occupancy by Seniors.
is defined by: 'Senior Housing' in Omniclass 11 (2013 02 26)

SingleFamilyHousing
type: Class
subclass of: Residential Building
comment: A dwelling unit for a service member or for an authorized government civilian and his/her authorized dependents when accompanied by those dependents.
is defined by: 'Single Family Residence' in Omniclass 11 (2013 02 26)

SleepingRoom
type: Class
subclass of: Space
comment: A private room where people sleep for the night.
is defined by: Omniclass 13-65 19 00

SocialHousingBuilding
type: Class
subclass of: Multi-Dwelling Housing
is defined by: 'LIHTC Tax Credit Housing' in Omniclass 11 (2013 02 26)

SpecialCareBuilding
type: Class
subclass of: Residential Building
comment: A dwelling containing multiple sleeping quarters with shared eating, living and lavatory facilities in addition to offering additional care and medical/health assistance from trained staff.
is defined by: 'Special Care Residence' in Omniclass 11 (2013 02 26)

Toilets
type: Class
subclass of: Space
comment: A space containing a toilet or similar fixture that disposes of human waste by using water to flush it through a drainpipe to another location.
is defined by: Omniclass 13-65 13 13

Building
subclass of: VolumetricZone
subclass of: Restriction
  on property: constructionYear
  max qualified cardinality: 1
  on data range: gYear

qualified cardinality: 1

max qualified cardinality: 1

max qualified cardinality: 1

max qualified cardinality: 1