The BIM4Ren intervention ontology
type: Ontology
version IRI: https://models.bim4ren.eu/core/intervention/0.1
contributor: Nathalie Charbel
contributor: Pierre Bourreau
description: The intervention ontology is part of the BIM4Ren project. It belongs to the core layer, and is used to model changes performed on the building and its different components during the building lifecycle. Through this ontology, a history of the evolution of the building can be modelled.

Checking
type: Class
subclass of: Event
comment: A revision of some elements of the building. Some examples are: energy, accoustic audits, boiler manadatory check...

Element
type: Class
comment: The element concerned by the intervention.

Event
type: Class
subclass of: Restriction
  on property: performedBy
  some values from: Organization
subclass of: Restriction
  on property: performedOn
  min qualified cardinality: 1
  on class: Element
subclass of: Restriction
  on property: endDate
  some values from: dateTime
subclass of: Restriction
  on property: startDate
  some values from: dateTime
comment: An intervention event. It is characterized by the elements impacted by the intervention, the date of the intervention, and the person/organization who performed the intervention.

Installation
type: Class
subclass of: Event
comment: Installation of the product/element. Includes a change (for instance, replacement of all radiators), or the installation of a bran new system (for instance, external insulation).

Repair
type: Class
subclass of: Event
comment: Maintenance of an already installed elements. Can include change of parameters for HVAC systems or change of part of the elements.