air tighthness
type: ObjectProperty
range: QuantityValue
label: ermeticità all'aria @it
label: estanqueidad @es
label: étanchéité à l'air @fr
narrow match: 3vHkMyoT0Hsm00051Mm008

COP
type: ObjectProperty
domain: Heat producer
comment: The coefficient of performance or COP (sometimes CP or CoP) of a heat pump, refrigerator or air conditioning system is a ratio of useful heating or cooling provided to work required.
label: coefficient de performance @fr
label: coefficient of performance
label: coefficiente di prestazione @it
label: coeficiente de operatividad @es
narrow match: 3W1b00qSWHuO00025QrE$V
narrow match: 3Wd O0qSeHuO00025QrE$V

discharge temperature
type: ObjectProperty
sub property of: temperature
domain: Producer
comment: The temperature of the output medium in a thermal loop.
narrow match: 22j rwRL92uutC7n opQsz

efficiency type
type: ObjectProperty
range: Efficiency type
label: tipo de rendimiento @es
label: tipo di rendimento @it
label: type du rendement @fr

exhaust temperature
type: ObjectProperty
sub property of: temperature
domain: Producer
comment: The temperature rejected by a thermal producer.

a1
type: ObjectProperty
comment: This factor describes thermal losses. The higher this value, the more losses the system has.
label: facteur de transmission de chaleur @fr
label: heat transmission factor
label: pertes à pourcentage constant @fr

a2
type: ObjectProperty
comment: Coefficient for the calculation of the coefficient of heat transmission dependent on temperature. The higher this value, the greater is the curvature of the curve.
label: coefficient de calcul de coefficient de transmission thermique selon la température. @fr
label: coefficient for the calculation of the coefficient of heat transmission dependent on temperature
label: pertes dont le pourcentage augmente avec la température @fr

infrared transmittance
type: ObjectProperty
sub property of: T
label: transmitancia infrarroja @es
label: transmittance infrarouge @fr
label: trasmittanza infrarossa @it

load
type: ObjectProperty
range: QuantityValue
label: carga @es
label: carico @it
label: charge @fr
narrow match: 1ML8E0qSGHuO00025QrE$V

maximal temperature
type: ObjectProperty
sub property of: setpoint
label: temperatura massima @it
label: temperatura máxima @es
label: température maximale @fr

minimal temperature
type: ObjectProperty
sub property of: setpoint
label: temperatura minima @it
label: temperatura mínima @es
label: température minimale @fr

nominal power
type: ObjectProperty
sub property of: power
label: puissance nominale @fr
label: puissance utile @fr

return temperature
type: ObjectProperty
sub property of: temperature
domain: Producer
comment: The temperature of the input medium in a thermal loop
narrow match: 1PxGW0qSuHuO00025QrE$V
narrow match: 1WUt 0qSuHuO00025QrE$V
narrow match: 2ZqF20qSGHuO00025QrE$V

setpoint
type: ObjectProperty
sub property of: temperature
label: consigne @fr
label: régulation @fr

stagnation temperature
type: ObjectProperty
sub property of: temperature
comment: The temperature at a stagnation point in a fluid flow. At a stagnation point the speed of the fluid is zero and all of the kinetic energy has been converted to internal energy and is added to the local static enthalpy. In both compressible and incompressible fluid flow, the stagnation temperature is equal to the total temperature at all points on the streamline leading to the stagnation point. The stagnation temperature is the maximum temperature that the collector’s absorber can reach at an ambient temperature of 30°C and an irradiation of 1000 W/m2. Stagnation temperature is also a measure of thermal losses of the collector and therefore describes the efficiency of the collector at higher temperatures.
label: temperature de estancamiento @es
label: temperature de ristagno @it
label: température de stagnation @fr

temperature spread
type: ObjectProperty
sub property of: temperature
domain: Producer
comment: the difference between the ambient temperature and the desire room temperature. The range of temperature a heat pump needs to provide
narrow match: 1w6yU0qSmHuO00025QrE$V
narrow match: 3k Vm0qU8HuO00025QrE$V

thermal efficiency
type: ObjectProperty
range: QuantityValue
label: rendement @fr
label: rendimento @it
label: rendimiento térmico @es
narrow match: 04OYo0qSaHuO00025QrE$V
narrow match: 3CMEg0qSGHuO00025QrE$V
narrow match: 3UEes0qSGHuO00025QrE$V
quantity kind: ThermalEfficiency

thermal mass
type: ObjectProperty
range: QuantityValue
label: masa térmica @es
label: massa termica @it
label: masse thermique @fr

R
type: ObjectProperty
range: QuantityValue
label: resistencia termica @es
label: resistenza termica @it
label: résistence thermique @fr
label: thermal resistance
quantity kind: ThermalResistance

U
type: ObjectProperty
range: QuantityValue
label: coefficient de transfert thermique @fr
label: coefficient of heat transfer
label: thermal transmittance
label: transfert thermique @fr
label: transmitancia térmica @es
label: trasmittanza termica @it
quantity kind: CoefficientOfHeatTransfer

T
type: ObjectProperty
range: QuantityValue
label: transmitancia @es
label: transmittance
label: trasmissione @it
quantity kind: Transmittance

visible transmittance
type: ObjectProperty
sub property of: T
label: transmitancia visible @es
label: transmittance visible @fr
label: trasmittanza visibile @it

Cool producer
type: Class
subclass of: Producer
comment: A cool producer asset.
label: Producteur de froid @fr

Efficiency type
type: Class
equivalent class: Class
  one of: Certified
  one of: Measured
label: Tipo de rendimiento @es
label: Tipo di rendimento @it
label: Type du rendement @fr

Heat producer
type: Class
subclass of: Producer
comment: A heat producer asset.
label: Producteur de chaleur @fr

Heat transfer element
type: Class
subclass of: Restriction
  on property: infrared transmittance
  some values from: QuantityValue
subclass of: Restriction
  on property: air tighthness
  all values from: QuantityValue
subclass of: Restriction
  on property: thermal mass
  all values from: QuantityValue
subclass of: Restriction
  on property: R
  all values from: QuantityValue
subclass of: Restriction
  on property: U
  all values from: QuantityValue
subclass of: Restriction
  on property: visible transmittance
  all values from: QuantityValue
comment: A heat transfer element is a passive element that can restrict or ease the transfer of heat between different zones.
label: Elément de transfert de chaleur @fr

Producer
type: Class
subclass of: Restriction
  on property: thermal efficiency
  all values from: QuantityValue
subclass of: Restriction
  on property: maximal temperature
  max qualified cardinality: 1
  on class: Producer
subclass of: Restriction
  on property: minimal temperature
  max qualified cardinality: 1
  on class: Producer
subclass of: Restriction
  on property: nominal power
  max qualified cardinality: 1
  on class: Producer

thermo-regulated element
type: Class
subclass of: Restriction
  on property: maximal temperature
  some values from: QuantityValue
subclass of: Restriction
  on property: minimal temperature
  some values from: QuantityValue
subclass of: Restriction
  on property: setpoint
  some values from: QuantityValue
label: élément thermo-régulé @fr

Certified
type: NamedIndividual
label: Agréé @fr
label: Certificado @es
label: Certificato @it

Certified
type: NamedIndividual
label: Declarado @es
label: Dichiarato @it
label: Déclaré @fr

Measured
type: NamedIndividual
label: Medido @es
label: Mesuré @fr
label: Misurato @it