Building Element Ontology
type: Ontology
language: en
description: The Building Element Ontology provides an ontology based on the IfcBuildingElement subtree in the IFC specification, containing a taxonomy of classes that allow to define common building elements.
modified: December 27th 2018
issued: 2018-12-27
license: https://creativecommons.org/licenses/by/1.0/
preferred namespace prefix: beo
preferred namespace uri: https://buildingsmart.org/ifc4-voc/buildingelement#
version info: December 27th 2018
version info: v0.1.0

Beam
type: Class
subclass of: Building Element
comment: A horizontal, or nearly horizontal, structural member that is capable of withstanding load primarily by resisting bending. It represents such a member from an architectural point of view. It is not required to be load bearing.
comment: A standard beam usually used horizontally. @nb-no
comment: http://bsdd.buildingsmart.org/#concept/details/3zXEi0qSCHuO00025QrE$V
label: Balk @nl
label: Bjælke @da
label: balken @de-de
label: biegeträger @de-de
label: bjelke @nb-no
label: poutre @fr-fr

Beam
type: Class
subclass of: Beam
comment: A horizontal, or nearly horizontal, structural member that is capable of withstanding load primarily by resisting bending. It represents such a member from an architectural point of view. It is not required to be load bearing.
comment: A standard beam usually used horizontally. @nb-no
comment: http://bsdd.buildingsmart.org/#concept/details/0KKIHMGYH7H8MAfgxbrxuV
label: balk @nl-nl
label: balken @de-de
label: biegeträger @de-de
label: bjelke @nb-no
label: ligger @nl-nl
label: poutre @fr-fr

Pre-cast Hollow Core Slab
type: Class
subclass of: Beam
comment: Platte mit rechteckigem Querschnitt, in der auf voller Länge in Längsrichtung kreisrunde oder ovale Hohlräume (Aussparungen) verlaufen @de-de
comment: dalle de section rectangulaire comportant des vides longitudinaux sur toute leur longueur ou des vides de forme ovale @fr-fr
comment: http://bsdd.buildingsmart.org/#concept/details/2gzZKHqELB$gPVKajRAFXc
comment: losa de sección rectangular con huecos circulares o óvales para toda su longitud @es-es
comment: monolithic prestressed or reinforced elements with a constant overall depth divided into an upper and lower flange, linked by vertical webs, so constituting cores as longitudinal voids the cross section of which is constant and presents one vertical axis.
comment: prostokątna płyta z okrągłymi lub owalnymi przestrzeniami na całej długości @pl-pl
comment: rectangular section slab with full-length longitudinal circular or oval shaped voids
comment: rectangular section slab with full-length longitudinal circular or oval shaped voids.
comment: rektangulärt bjälklag med längsgående cirkelformade eller ovalformade tomrum längs med hela bjälklaget @sv-se
comment: rektangulært element med hulrum i fuld længde i langsgående, cirkulær eller oval form @dk-dk
comment: rektangulært element med langsgående sirkulære eller ovale hulrom i full lengde @nb-no
comment: suorakaiteenmuotoinen laattaelementti, jossa on koko pituudeltaan pyöreitä tai ovaalinmuotoisia onteloita/tyhjätiloja @fi-fi
comment: плоча с правоъгълно сечение и кухини по цялата дължина с надлъжна кръгла или овална форма @bg-bg
label: dalle alvéolée préfabriquée en béton @fr-fr
label: förtillverkade betongprodukter - håldäcksplattor @sv-se
label: hulldekke @nb-no
label: hulldekkeelement @nb-no
label: lastre alveolari precompresse @it-it
label: losa alveolar prefabricada @es-es
label: ontelolaatta @fi-fi
label: pre-cast hollow core slab
label: prefabrikkert hulldekke @nb-no
label: prefabrykowana płyta kanałowa stropowa @pl-pl
label: præfabrikeret huldækelement @dk-dk
label: werkseitig hergestellte Hohlplatte @de-de
label: готови плочи с кухини @bg-bg

Joiste
type: Class
subclass of: Beam
comment: http://bsdd.buildingsmart.org/#concept/details/1_zkjNhS95oA5oDSSTnEvO
label: tilpasset bjelke @nb-no

Lintel
type: Class
subclass of: Beam
comment: http://bsdd.buildingsmart.org/#concept/details/1PivEYC0575QGoaAFjN8c9
label: overdekking @nb-no

Spandrel
type: Class
subclass of: Beam
comment: http://bsdd.buildingsmart.org/#concept/details/2$vr6UW$f3SwHilnemEZoH
label: brystning @nb-no

T_Beam
type: Class
subclass of: Beam
comment: http://bsdd.buildingsmart.org/#concept/details/1o9Up6wBr339DlpjWIWE$l
label: t_bjelke @nb-no

Building Element
type: Class
subclass of: SomeItems
subclass of: Product
comment: Bauelement @de-de
comment: Comprises all elements that are primarily part of the construction of a building, i.e., its structural and space separating system. Building elements are all physically existent and tangible things.
comment: http://bsdd.buildingsmart.org/#concept/details/2AFYKXkEn7RxYuvbduGfUV
label: Bauteil @de-de
label: Elément de construction @fr-fr

Building Element Part
type: Class
subclass of: Element Component
comment: http://bsdd.buildingsmart.org/#concept/details/3v2S1DH0r50BHIhWE6QHMZ
comment: ifcbuildingelementpart represents major components as subordinate parts of a building element. typical usage examples include precast concrete sandwich walls, where the layers may have different geometry representations. in this case the layered material representation does not sufficiently describe the element. each layer is represented by an own instance of the ifcbuildingelementpart with its own geometry description. the kind of building element part is further specified by a corresponding instance of ifcbuildingelementparttype, referred to by ifcreldefinesbytype.
label: Teil eines Bauelements @de-de
label: partie d'élément de construction @fr-fr

Insulation
type: Class
subclass of: Building Element Part
comment: http://bsdd.buildingsmart.org/#concept/details/2CF$o8Mgv2_xbw_kioa_YW
label: isolasjon @nb-no

Precast Panel
type: Class
subclass of: Building Element Part
comment: http://bsdd.buildingsmart.org/#concept/details/0pt2K5QIXB89suCXlsQZw$

Chimney
type: Class
subclass of: Building Element
comment: A vertical structure of brick, masonry, or steel that carries exhaust gases or steam away from a fire, engine, etc.
comment: Typically vertical, or as near as vertical, parts of the construction of a building and part of the building fabric. Often constructed by pre-cast or insitu concrete, today seldom by bricks.
comment: http://bsdd.buildingsmart.org/#concept/details/0xE4A0qSaHuO00025QrE$V
comment: konstruksjon bestående av én eller flere vegger som omslutter én eller flere røykkanaler @nb-no
comment: structure consisting of a wall or walls enclosing a flue or flues
label: Abgasanlage @de-de
label: Abgassanlage @de-de
label: Schoorsteen @nl
label: Schornstein @de-de
label: Skorsten @da
label: cheminée @fr-fr
label: conduit de fumée @fr-fr
label: pipe @nb-no
label: skorstein @nb-no

Column
type: Class
subclass of: Building Element
comment: A vertical structural member which often is aligned with a structural grid intersection. It represents a vertical, or nearly vertical, structural member that transmits, through compression, the weight of the structure above to other structural elements below. It represents such a member from an architectural point of view. It is not required to be load bearing.
comment: http://bsdd.buildingsmart.org/#concept/details/1CDOE0qSeHuO00025QrE$V
label: Kolom @nl
label: Stütze / Pfeiler @de-de
label: Søjle @da
label: poteau @fr-fr

Column
type: Class
subclass of: Column
comment: A vertical structural member which often is aligned with a structural grid intersection. It represents a vertical, or nearly vertical, structural member that transmits, through compression, the weight of the structure above to other structural elements below. It represents such a member from an architectural point of view. It is not required to be load bearing.
comment: Søyle @nb-no
comment: http://bsdd.buildingsmart.org/#concept/details/1k5QL8XejA8v7H3XePklst
label: Druckstab @de-de
label: Stütze @de-de
label: poteau @fr-fr

Pilaster
type: Class
subclass of: Column
comment: Pilaster @nb-no
comment: http://bsdd.buildingsmart.org/#concept/details/08F4W56in3zeQ$ucplQrmF
comment: http://bsdd.buildingsmart.org/#concept/details/312dw0BS8Htm00025QrE$V
comment: vertikalt fremspring på vegg @nb-no

Covering
type: Class
subclass of: Building Element
comment: An element which covers some part of another element and is fully dependent on that other element.
comment: http://bsdd.buildingsmart.org/#concept/details/3uBPs0qSyHuO00025QrE$V
label: Bekleidung / Belag @de-de
label: kledning / belegg @nb-no
label: revêtement @fr-fr

Ceiling
type: Class
subclass of: Covering
comment: http://bsdd.buildingsmart.org/#concept/details/05pSAVKa99GQlGChUhmlv1
label: tak @nb-no

Cladding
type: Class
subclass of: Covering
comment: http://bsdd.buildingsmart.org/#concept/details/0MKWgDXdn9OfqhAzFzvTUH
label: kledning @nb-no

Flooring
type: Class
subclass of: Covering
comment: http://bsdd.buildingsmart.org/#concept/details/1MZNPRnDz1jOV_XCmntitl
label: gulv @nb-no

Insulation
type: Class
subclass of: Covering
comment: http://bsdd.buildingsmart.org/#concept/details/0m_WyU8An7RAFjJPRPQn1j
label: isolasjon @nb-no

Membrane
type: Class
subclass of: Covering
comment: http://bsdd.buildingsmart.org/#concept/details/3vHSkCoT0Hsm00051Mm008
comment: vanntett og/eller damptett lag som er festet til sluket i gulvet, på gulvet eller på taket @nb-no
comment: watertight and/or damp proof layer attached to the gully either in the floor or on the floor or roof
label: Dichtungsbahn @de-de
label: film d'étanchéité @fr-fr
label: membran @nb-no

Molding
type: Class
subclass of: Covering
comment: http://bsdd.buildingsmart.org/#concept/details/0rO5hENaL0Sx5ncSZm5QWi
comment: http://bsdd.buildingsmart.org/#concept/details/39P8INeF1DvPcZnWFCA0jO
label: Gesims @de-de
label: Matériau de la moulure @fr-fr
label: gerikt @nb-no
label: taklist @nb-no

Roofing
type: Class
subclass of: Covering
comment: http://bsdd.buildingsmart.org/#concept/details/1roIuYcU5AxfQM_Wf18q7t
label: takdekke @nb-no
label: taktekking @nb-no

Skirting Board
type: Class
subclass of: Covering
comment: http://bsdd.buildingsmart.org/#concept/details/0rhD2N_cvFRRnqQ6pRM9aE
label: Matériau de la plinthe @fr-fr
label: Sockelleiste @de-de
label: skirtingboard
label: 幅木材 @ja-jp

Sleeving
type: Class
subclass of: Covering
comment: http://bsdd.buildingsmart.org/#concept/details/2mox_rbmb43xWuIkQmJqW1
label: strømpe @nb-no

Wrapping
type: Class
subclass of: Covering
comment: http://bsdd.buildingsmart.org/#concept/details/16XES3__TAdwQ57Ox4T_V8
label: innkledning @nb-no

Curtain Wall
type: Class
subclass of: Building Element
comment: An exterior wall of a building which is an assembly of components, hung from the edge of the floor/roof structure rather than bearing on a floor.
comment: Vertikale und horizontale Bauteile, die untereinander verbunden und mit dem Tragwerk des Gebäudes verankert sind sowie gefüllt sind, um eine raumabschließende, durchgehende Außenschicht zu bilden, die alleine oder gemeinsam mit der übrigen Baukonstruktion, alle normalen Funktionen einer Außenwand bietet, jedoch keine lastabtragenden Funktionen erfüllt @de-de
comment: elementi strutturali verticali e orizzontali, collegati assieme e ancorati alla struttura di supporto dell'edificio e tamponati, a formare una pelle di chiusura continua che fornisce, da sola o in congiunzione con la costruzione, tutte le normali funzioni di un muro esterno, ma non assume nessuna delle caratteristiche portanti della struttura dell'edificio @it-it
comment: elementos estructurales verticales y horizontales, conectados entre sí y anclados a la estructura portante del edificio y rellenados, para formar un conjunto de piel continua que proporciona, por sí mismo o conjuntamente con la construcción del edificio, todas las funciones normales de una pared externa, pero no se hace cargo de ninguna de las características portantes de la estructura del edificio @es-es
comment: http://bsdd.buildingsmart.org/#concept/details/1nBFK0qT0HuO00025QrE$V
comment: les éléments de structure verticaux et horizontaux reliés ensemble et ancrés sur la structure portante du bâtiment et remplis pour former un espace renfermant une peau continue qui fournit, par elle-même ou en combinaison avec la construction du bâtiment, toutes les fonctions normales d'un mur extérieur, mais n'emprunte aucune des caractéristiques de résistance à la charge de la structure du bâtiment @fr-fr
comment: lodrette og vandrette bygningselementer, der er bundet sammen og forankret til bygningens bærende konstruktion og fyldt, så de danner en fortløbende inddækning, der i sig selv eller sammen med bygningskonstruktionen leverer alle en ydermurs normale funktioner, men som ikke påtager sig nogen af bygningskonstruktionens bærende egenskaber @dk-dk
comment: pionowe i poziome elementy konstrukcyjne, połączone ze sobą i zakotwiczone w konstrukcji nośnej budynku i w zabudowie typu plomba, tworzące przestrzeń obejmującą ciągłą warstwę, która zapewnia, samodzielnie lub w połączeniu z konstrukcją budynku, wszystkie normalne funkcje ściany zewnętrznej, ale nie spełnia żadnej funkcji nośnej dla konstrukcji budynku @pl-pl
comment: pysty- ja vaakasuuntaisia rakenneosia, toisiinsa liitettyinä ja rakennuksen kantavaan rakenteeseen kiinnitettynä, täydennettynä muodostamaan suojaavan yhtenäisen pintatilan, jolla on sellaisenaan tai yhdessä rakennuksen kanssa kaikki ulkoisen seinän normaalit toimintaominaisuudet, mutta jota ei käytetä kantavana rakenteena @fi-fi
comment: utvendig, ikkebærende veggkonstruksjon forankret til bygningens hovedbærekonstruksjon. påhengsvegger bygges vanligvis av et rammeverk av metall, tre eller PVC med vertikale og horisontale komponenter som overfører påhengsveggens egenvekt og eventuelle vindkrefter til bygningens bærekonstruksjon @nb-no
comment: vertical and horizontal structural members, connected together and anchored to the supporting structure of the building and infilled, to form a space enclosing continuous skin, which provides, by itself or in conjunction with the building construction, all the normal functions of an external wall, but does not take on any of the load bearing characteristics of the building structure
comment: vertikala och horisontella byggnadsdelar som har sammanfogats och förankrats vid byggnadens stödkonstruktion och isolerats, för att skapa en inhägnad med kontinuerlig yta som, av sig själv eller tillsammans med byggnadskonstruktionen, erbjuder alla funktioner som en yttervägg vanligtvis har, men som inte har några av byggnadskonstruktionens bärande egenskaper @sv-se
comment: вертикални и хоризонтални конструктивни елементи, свързани помежду си, закрепени към основната конструкция на сградата и запълнени, за да образуват непрекъсната ограждаща пространството обвивка, която осигурява, самостоятелно или съвместно с конструкцията на сградата, всички изисквани функции към една външна стена, но без да изпълнява никакви функции свързани с носимоспособността на сградната конструкция @bg-bg
label: Gordijngevel @nl
label: Mur rideau @fr-fr
label: Vorhangfassade @de-de
label: Vorhangfassadenbausatz @de-de
label: julkisivujärjestelmä @fi-fi
label: påhengsvegg @nb-no
label: sats till utfackningsväggar @sv-se
label: zestaw ściany osłonowej @pl-pl
label: монтажни модули за окачени фасади @bg-bg

Discrete Accessory
type: Class
subclass of: Element Component
comment: A representation of different kinds of accessories included in or added to elements.
comment: http://bsdd.buildingsmart.org/#concept/details/0W7W20qT8HuO00025QrE$V
label: Accessoire composé @fr-fr
label: Zusatzgerät / Einbauteil @de-de

Anchor Plate
type: Class
subclass of: Discrete Accessory
comment: http://bsdd.buildingsmart.org/#concept/details/1XD5ysVrvF$haI5OgtznWi

Bracket
type: Class
subclass of: Discrete Accessory
comment: An artefact which is projecting from the side of a wall or other structure intended to support some other artefacts.
comment: Brakkett for utstyr @nb-no
comment: Innstøpningsbrakett @nb-no
comment: http://bsdd.buildingsmart.org/#concept/details/3EGCgYGC9F3PmaQ821Ax2u
comment: http://bsdd.buildingsmart.org/#concept/details/3vHPwWoT0Hsm00051Mm008
comment: http://bsdd.buildingsmart.org/#concept/details/3vHcVCoT0Hsm00051Mm008
label: Console @nl-nl
label: Winkellasche @de-de
label: bracket for innerwall
label: brakett @nb-no
label: brakett innervegg @nb-no
label: console
label: crochet @fr-fr
label: innervegg @nb-no
label: innerveggbrakett @nb-no
label: innstøpningsbrakett @nb-no

Shoe
type: Class
subclass of: Discrete Accessory
comment: http://bsdd.buildingsmart.org/#concept/details/1i44itooP5F9e53Jc$HR0o
label: søylesko @nb-no

Door
type: Class
subclass of: Building Element
comment: Bygningsdel som dekker en åpning i utvendig eller innvendig vegg, og som kan åpnes eller stenges for passasje. @nb-no
comment: En åpning i en barriære med et dørblad som kan lukke åpningen og en ramme som holder dørbladet. @nb-no
comment: a complete unit consisting of a door frame and a door leaf or leaves, supplied with the essential hardware and wheatherseal, as a product from a single source
comment: construction for closing an opening intended primarily for access or egress or both. Typically consisting of a panel that swings on hinges or that slides or rotates
comment: http://bsdd.buildingsmart.org/#concept/details/3vHRQ8oT0Hsm00051Mm008
label: Deur @nl-nl
label: Dør @da
label: Tür @de-de
label: Türeinheit @de-de
label: dør @nb-no
label: dør med karm @nb-no
label: porte @fr-fr

Door
type: Class
subclass of: Door
comment: A standard door usually within a wall opening, as a door panel in a curtain wall, or as a "free standing" door.
comment: Bygningsdel som dekker en åpning i utvendig eller innvendig vegg, og som kan åpnes eller stenges for passasje. @nb-no
comment: En åpning i en barriære med et dørblad som kan lukke åpningen og en ramme som holder dørbladet. @nb-no
comment: a complete unit consisting of a door frame and a door leaf or leaves, supplied with the essential hardware and wheatherseal, as a product from a single source
comment: construction for closing an opening intended primarily for access or egress or both. Typically consisting of a panel that swings on hinges or that slides or rotates
comment: http://bsdd.buildingsmart.org/#concept/details/2reX7MzyDDPP8OCoYtmU7d
label: Deur @nl-nl
label: Tür @de-de
label: Türeinheit @de-de
label: bloc-porte @fr-fr
label: deur @nl-nl
label: dør @nb-no
label: dør med karm @nb-no
label: porte @fr-fr

Gate
type: Class
subclass of: Door
comment: Det engelske ordet 'gate' og det franske ordet 'portail' refererer til produkter utenfor bygninger, for eksempel i innhegninger, gjerder osv. Det tyske ordet 'Tor' refererer til alle produkter for å stenge åpninger, som tillater passering av kjøretøyer. @nb-no
comment: a movable barrier, usually on hinges, closing an opening in a fence, wall, or other enclosure
comment: http://bsdd.buildingsmart.org/#concept/details/3C6qVkdNfEGOKvZBfksYwB
comment: innretning for å lukke en åpning som er beregnet for passering av kjøretøyer og personer @nb-no
label: Hek @nl-nl
label: Poort @nl-nl
label: Tor @de-de
label: fermeture @fr-fr
label: port @nb-no

Roof Hatch
type: Class
subclass of: Door
comment: http://bsdd.buildingsmart.org/#concept/details/3_T7f4cxzB_ur2vAtd6pJe
label: Trap Door
label: takluke @nb-no

Element Component
type: Class
subclass of: Product
comment: A representation for minor items included in, added to or connecting to or between elements, which usually are not of interest from the overall building structure viewpoint. However, these small parts may have vital and load carrying functions within the construction. These items do not provide any actual space boundaries. Typical examples include different kinds of fasteners and various accessories.
comment: http://bsdd.buildingsmart.org/#concept/details/2pKpW0qSeHuO00025QrE$V
label: Composant d'élément @fr-fr
label: Elementenbestandteil @de-de

Fastener
type: Class
subclass of: Element Component
comment: Jointing component that is used to operate a door, window, shutter, gate or drawer .
comment: Representations of fixing parts which are used as fasteners to connect or join elements with other elements.
comment: http://bsdd.buildingsmart.org/#concept/details/2$v8e0qUGHuO00025QrE$V
label: Befestigungsmittel @de-de
label: Elément d'assemblage @fr-fr
label: festeinnretning @nb-no

Glue
type: Class
subclass of: Fastener
comment: bindemedel eller bindemedelslösning för hopfogning av fasta material @sv-se
comment: binder or binder solution for joining solid materials
comment: http://bsdd.buildingsmart.org/#concept/details/097NQ9z4T7eOn7nJCQC0yI
label: lim @nb-no

Mortar
type: Class
subclass of: Fastener
comment: http://bsdd.buildingsmart.org/#concept/details/0dS2xSsC1BbvRjM1MIjNn5
label: mørtel @nb-no

Weld
type: Class
subclass of: Fastener
comment: a weld seam between parts of metallic material or other suitable materials
comment: http://bsdd.buildingsmart.org/#concept/details/01DZw_Z2b4CwKEwBQ9ERPZ
label: sveis @nb-no

Footing
type: Class
subclass of: Building Element
comment: A part of the foundation of a structure that spreads and transmits the load to the soil. Also characterized as shallow foundation, where the loads are transferred to the ground near the surface.
comment: Flachgründung @de-de
comment: http://bsdd.buildingsmart.org/#concept/details/2vyAW0qUWHuO00025QrE$V
label: Fundament @de-de
label: Funderingsvoet @nl-nl
label: fondation @fr-fr

Caisson Foundation
type: Class
subclass of: Footing
comment: http://bsdd.buildingsmart.org/#concept/details/0MGkpmTGDFC80qy7qA0W2w
label: senkekasse til fundament @nb-no

Footing Beam
type: Class
subclass of: Footing
comment: http://bsdd.buildingsmart.org/#concept/details/3hRbiifMvFOgC3tEfSPD8X

Pad Footing
type: Class
subclass of: Footing
comment: http://bsdd.buildingsmart.org/#concept/details/1XJ0TK6AbBfxMCQLLkdnDr

Pile Cap
type: Class
subclass of: Footing
comment: http://bsdd.buildingsmart.org/#concept/details/3$LxhKMZjFuBdi75OQXj0L

Strip Footing
type: Class
subclass of: Footing
comment: http://bsdd.buildingsmart.org/#concept/details/0mDEbMPpzB9B_vQTUHZLHe
label: platefundament @nb-no

MechanicalFastener
type: Class
subclass of: Element Component
comment: A fastener connecting building elements mechanically. A single instance may represent one or many of actual mechanical fasteners, for example an array of bolts or a row of nails.
comment: http://bsdd.buildingsmart.org/#concept/details/2$KV20qV0HuO00025QrE$V
label: Mechanical Fastener
label: Mechanisches Befestigungsmittel @de-de
label: mekanisk festemiddel @nb-no

Anchor Bolt
type: Class
subclass of: MechanicalFastener
comment: http://bsdd.buildingsmart.org/#concept/details/3NJqge3HD7du28Nje_S1Yv
label: mekanisk ankerbolt @nb-no

Bolt
type: Class
subclass of: MechanicalFastener
comment: a threaded cylindrical rod that engages with a similarly threaded hole in a nut or any other part to form a fastener. the mechanical fastener often also includes one or more washers and one or more nuts.
comment: http://bsdd.buildingsmart.org/#concept/details/2yfVRHZ2X7heCLVLk0oVBK
label: mekanisk festemiddel - bolt @nb-no

Dowel
type: Class
subclass of: MechanicalFastener
comment: Dybel @nb-no
comment: http://bsdd.buildingsmart.org/#concept/details/2jZSkKNyPBMwSeeMxlYWrc
comment: http://bsdd.buildingsmart.org/#concept/details/3vHOxEoT0Hsm00051Mm008
comment: rod protruding from the toe of the sheet pile, used for fixing sheet piles to the bed-rock
comment: stag som stikker ut fra foten av spuntnålen, og som brukes for å feste spunten til fjell @nb-no
label: Felsdübel @de-de
label: dowel
label: dybel @nb-no
label: goujon pour rocher @fr-fr
label: rock dowel

Nail
type: Class
subclass of: MechanicalFastener
comment: http://bsdd.buildingsmart.org/#concept/details/1WICu7sp12cQ$$2QCHf$DB
label: spiker @nb-no

Nail Plate
type: Class
subclass of: MechanicalFastener
comment: http://bsdd.buildingsmart.org/#concept/details/26FDcCBjH3BOLZTZb29fxk
label: spikerplate @nb-no

Rivet
type: Class
subclass of: MechanicalFastener
comment: http://bsdd.buildingsmart.org/#concept/details/1zynxAt3H1eAVfmukRcO4R
label: nagle @nb-no

Screw
type: Class
subclass of: MechanicalFastener
comment: http://bsdd.buildingsmart.org/#concept/details/2NLmoal3LAGxceh8SPCvI7
label: skrue @nb-no

Shear Connector
type: Class
subclass of: MechanicalFastener
comment: http://bsdd.buildingsmart.org/#concept/details/0sHCCoroj0pesEpqdsmtRT

Staple
type: Class
subclass of: MechanicalFastener
comment: http://bsdd.buildingsmart.org/#concept/details/3ugeBu3lP8WANu_d7DFAtv
label: stift @nb-no

Stud Shear Connector
type: Class
subclass of: MechanicalFastener
comment: http://bsdd.buildingsmart.org/#concept/details/2VmXuOwNvFIxXMT91lYI9q

Member
type: Class
subclass of: Building Element
comment: A structural member designed to carry loads between or beyond points of support. It is not required to be load bearing. A linear architectural or structural element that cannot be expressed more specifically as either a beam or column.
comment: http://bsdd.buildingsmart.org/#concept/details/11GXc0qV4HuO00025QrE$V
label: Membre @fr-fr
label: Stab / Stabträger @de-de
label: konstruksjonsdel @nb-no

Brace
type: Class
subclass of: Member
comment: http://bsdd.buildingsmart.org/#concept/details/0ccYVvWMX5jwoOSredVplR
label: avstiver @nb-no

Chord
type: Class
subclass of: Member
comment: http://bsdd.buildingsmart.org/#concept/details/1_qCPXQ3j1VBh_PCDSM2PC
label: gurt @nb-no

Collar
type: Class
subclass of: Member
comment: http://bsdd.buildingsmart.org/#concept/details/1r9F5o8Pv9mPKppdGc$YOw
label: krage @nb-no

Member
type: Class
subclass of: Member
comment: A structural member designed to carry loads between or beyond points of support. It is not required to be load bearing. A linear architectural or structural element that cannot be expressed more specifically as either a beam or column.
comment: http://bsdd.buildingsmart.org/#concept/details/11GXc0qV4HuO00025QrE$V
label: Membre @fr-fr
label: Stab / Stabträger @de-de
label: konstruksjonsdel @nb-no

Mullion
type: Class
subclass of: Member
comment: http://bsdd.buildingsmart.org/#concept/details/2H6TZXz1vEFOlOdhLv3CD7
label: midtstolpe @nb-no

Plate
type: Class
subclass of: Member
comment: A planar and often flat part with constant thickness. May carry loads between or beyond points of support, or provide stiffening.
comment: http://bsdd.buildingsmart.org/#concept/details/3zdC5dewn4ROXxRERahlnc
label: Platte / Paneel @de-de
label: plaque @fr-fr
label: plate @nb-no
label: platevarmeveksler @nb-no

Post
type: Class
subclass of: Member
comment: a linear member (usually used vertically) within a roof structure to support purlins
comment: http://bsdd.buildingsmart.org/#concept/details/3pLJTABEHCJeV4uMg1OJxY
label: stolpe @nb-no

Purlin
type: Class
subclass of: Member
comment: http://bsdd.buildingsmart.org/#concept/details/2ClC__ZBT6lgGn9bEtyKAq
label: takås @nb-no

Rafter
type: Class
subclass of: Member
comment: http://bsdd.buildingsmart.org/#concept/details/14MOjpDn1DYfI9uAgvn_Mm
comment: sperre @nb-no

Stringer
type: Class
subclass of: Member
comment: http://bsdd.buildingsmart.org/#concept/details/31phWfaoDEDwTkU1_cQp7G
label: vange @nb-no

Strut
type: Class
subclass of: Member
comment: http://bsdd.buildingsmart.org/#concept/details/0F1OouH1f9rPC$dWa4xYLb
label: trykkstav @nb-no

Stud
type: Class
subclass of: Member
comment: http://bsdd.buildingsmart.org/#concept/details/14DS4URKP2au1B2s5ghLFp
label: stender @nb-no

Pile
type: Class
subclass of: Building Element
comment: A vertical structural member of timber, concrete, or steel, driven into the earth as a foundation or support for a structure for the transfer of actions.
comment: En stråle av tømmer, betong eller stål, drevet ned i jorden som fundament eller støtte til en struktur. @nb-no
comment: http://bsdd.buildingsmart.org/#concept/details/3vHXEAoT0Hsm00051Mm008
comment: slankt bærende element i grunnen for overføring av laster. I denne europeiske standarden er slankhetsforholdet ikke begrenset @nb-no
label: Fundament / Tiefgründung @de-de
label: Pfahl @de-de
label: pel @nb-no
label: pele @nb-no
label: pieu @fr-fr
label: pæl @nb-no

Bored Pile
type: Class
subclass of: Pile
comment: http://bsdd.buildingsmart.org/#concept/details/1INEbwMtrBy9rKhAuvXYmq
label: boret pel @nb-no

Cohesion Pile
type: Class
subclass of: Pile
comment: http://bsdd.buildingsmart.org/#concept/details/3xzAjG3Uv5qeCDRxYCXd4d
label: kohesjon pel @nb-no

Driven Pile
type: Class
subclass of: Pile
comment: http://bsdd.buildingsmart.org/#concept/details/2Qg5YD6TD299EHtweCaOOy
label: rammet pel @nb-no

Friction Pile
type: Class
subclass of: Pile
comment: http://bsdd.buildingsmart.org/#concept/details/3LgOubO_D3EhcElUZP9dMe
label: friksjonspele @nb-no

Jet Grouting Pile
type: Class
subclass of: Pile
comment: http://bsdd.buildingsmart.org/#concept/details/1tI0jqBjHEmADWyrGGYig6

Support
type: Class
subclass of: Pile
comment: http://bsdd.buildingsmart.org/#concept/details/3qZud6iazFjOZ3wK3WoQch
label: støtte @nb-no

Plate
type: Class
subclass of: Building Element
comment: A planar and often flat part with constant thickness. May carry loads between or beyond points of support, or provide stiffening.
comment: http://bsdd.buildingsmart.org/#concept/details/3z14Y0qVCHuO00025QrE$V
label: Platte / Paneel @de-de
label: plaque @fr-fr
label: plate @nb-no

Curtain Panel
type: Class
subclass of: Plate
comment: a planar element within a curtain wall, often consisting of a frame with fixed glazing
comment: http://bsdd.buildingsmart.org/#concept/details/2N7mbvPFL0QRlf$nLuQE0U
label: skjermpanel @nb-no

Sheet
type: Class
subclass of: Plate
comment: http://bsdd.buildingsmart.org/#concept/details/2C4D8j05v51eRokWOWtlju

Railing
type: Class
subclass of: Building Element
comment: A frame assembly adjacent to human circulation spaces and at some space boundaries where it is used in line of walls or to compliment walls. Designed to aid humans, either as an optional physical support, or to prevent injury by falling.
comment: http://bsdd.buildingsmart.org/#concept/details/02irk0qVyHuO00025QrE$V
label: Garde corps @fr-fr
label: Geländer @de-de
label: Gelænder @da
label: Hekwerk @nl-nl
label: Leuning @nl
label: Reling @nl-nl
label: garde-corps @fr-fr
label: rekkverk @nb-no

Balustrade
type: Class
subclass of: Railing
comment: A balustrade is a separation construction alongside the edges of floors, roofs, stairs and ramps, protecting against falling into the deep.
comment: http://bsdd.buildingsmart.org/#concept/details/0ZHKicPyL9l8uyCir_Dsef
comment: http://bsdd.buildingsmart.org/#concept/details/30Ez0HE6XAHQh6wJkRK6T$
label: Geländer @de-de
label: Hekwerk @nl-nl
label: balustrader @nb-no
label: rekkverk @nb-no

Guardrail
type: Class
subclass of: Railing
comment: A frame assembly adjacent to human circulation spaces and at some space boundaries where it is used in line of walls or to compliment walls. Designed to aid humans, either as an optional physical support, or to prevent injury by falling.
comment: http://bsdd.buildingsmart.org/#concept/details/2804vLstn5DfaH_vxv53w3
label: Garde corps @fr-fr
label: Geländer @de-de
label: garde-corps @fr-fr
label: rekkverk @nb-no

Handrail
type: Class
subclass of: Railing
comment: Håndlister, typisk i korridorer @nb-no
comment: http://bsdd.buildingsmart.org/#concept/details/3vHRZWoT0Hsm00051Mm008
label: Handlauf @de-de
label: håndlist @nb-no
label: main courante @fr-fr

Ramp
type: Class
subclass of: Building Element
comment: A vertical passageway which provides a human circulation link between one floor level and another floor level at a different elevation. Normally does not include steps.
comment: Rampe @nb-no
comment: http://bsdd.buildingsmart.org/#concept/details/0kpjo0qVyHuO00025QrE$V
label: Helling @nl
label: Rampe @da
label: helling @nl-nl
label: hellingbaan @nl-nl
label: rampe @nb-no
label: skråplan @nb-no

Half Turn Ramp
type: Class
subclass of: Ramp
comment: http://bsdd.buildingsmart.org/#concept/details/1hJB5FgjL4_v2TrvOBjmzz
label: halv omdreining rampe @nb-no

Quarter Turn Ramp
type: Class
subclass of: Ramp
comment: http://bsdd.buildingsmart.org/#concept/details/1FZ7G8CAP2UxmW6fnuOOfQ
label: rampe med en sving @nb-no

Spiral Ramp
type: Class
subclass of: Ramp
comment: http://bsdd.buildingsmart.org/#concept/details/2__YGgu4XCN9NmT3LhvE6V

Straight Run Ramp
type: Class
subclass of: Ramp
comment: http://bsdd.buildingsmart.org/#concept/details/1SYNqJ72H64g7EG2vm8VJu

Two Quarter Turn Ramp
type: Class
subclass of: Ramp
comment: http://bsdd.buildingsmart.org/#concept/details/2wUjACPhnDyAgFiGarLaek
label: rampe med to svinger @nb-no

Two Straight Run Ramp
type: Class
subclass of: Ramp
comment: http://bsdd.buildingsmart.org/#concept/details/2skPwOQSH1Ex7UR3SpDGbT

Ramp Flight
type: Class
subclass of: Building Element
comment: A single inclined segment, or several inclined segments that are connected by a horizontal segment, referred to as a landing.
comment: http://bsdd.buildingsmart.org/#concept/details/1kbSG0qVyHuO00025QrE$V
label: Rampenlauf @de-de
label: Volée @fr-fr
label: rampe @nb-no

Spiral
type: Class
subclass of: Ramp Flight
comment: http://bsdd.buildingsmart.org/#concept/details/0CDsSbmyb4GA$0xajhCLYB
label: spiral @nb-no
label: vindel @nb-no

Straight
type: Class
subclass of: Ramp Flight
comment: http://bsdd.buildingsmart.org/#concept/details/0fyv31IoL8mwvU9TcZR2FC
label: rett @nb-no

Reinforcing Bar
type: Class
subclass of: Reinforcing Element
comment: a reinforcing bar is usually made of steel with manufactured deformations in the surface, and used in concrete and masonry construction to provide additional strength. a single instance of this class may represent one or many of actual rebars, for example a row of rebars.
comment: http://bsdd.buildingsmart.org/#concept/details/1zlbN6A$z4r8Er6nWNbSMZ
label: Bewehrungsstab @de-de
label: armeringsstang @nb-no
label: barre d'armature @fr-fr

Anchoring
type: Class
subclass of: Reinforcing Bar
comment: http://bsdd.buildingsmart.org/#concept/details/3X1mNZzk542ez6g92TTVdH

Edge
type: Class
subclass of: Reinforcing Bar
comment: http://bsdd.buildingsmart.org/#concept/details/0tRGNh1sv19OvGghikeGYQ

Ligature
type: Class
subclass of: Reinforcing Bar
comment: http://bsdd.buildingsmart.org/#concept/details/09DzOB3qT10AwjdzYLo1LA

Main
type: Class
subclass of: Reinforcing Bar
comment: http://bsdd.buildingsmart.org/#concept/details/0ZDnwDkMT9fhTxjjLnIpAX

Punching
type: Class
subclass of: Reinforcing Bar
comment: http://bsdd.buildingsmart.org/#concept/details/1RO$_IvNP7eQABna$VzMm_

Ring
type: Class
subclass of: Reinforcing Bar
comment: http://bsdd.buildingsmart.org/#concept/details/2zA8DFnW5B8hiBjIlXcktx

Shear
type: Class
subclass of: Reinforcing Bar
comment: http://bsdd.buildingsmart.org/#concept/details/220Wv8D4n11hjTIo_DzfBR
label: skive @nb-no

Stud
type: Class
subclass of: Reinforcing Bar
comment: http://bsdd.buildingsmart.org/#concept/details/3cWXnrQEvAfRCh9LjK26$R
label: stender @nb-no

Reinforcing Element
type: Class
subclass of: Element Component
comment: a reinforcing element represents bars, wires, strands, meshes, tendons, and other components embedded in concrete in such a manner that the reinforcement and the concrete act together in resisting forces.
comment: http://bsdd.buildingsmart.org/#concept/details/1aiY$$Wf98m8a5cp3Hzgdu
label: Bewehrung @de-de
label: elément d'armature @fr-fr

Reinforcing Mesh
type: Class
subclass of: Reinforcing Element
comment: a reinforcing mesh is a series of longitudinal and transverse wires or bars of various gauges, arranged at right angles to each other and welded at all points of intersection; usually used for concrete slab reinforcement. it is also known as welded wire fabric. in scope are plane meshes as well as bent meshes.
comment: http://bsdd.buildingsmart.org/#concept/details/3R4n2h6wn67Q4clocrGT7J
label: Bewehrungsmatte @de-de
label: treillis @fr-fr

Roof
type: Class
subclass of: Building Element
comment: A covering of the top part of a building. Protects the building against the effects of weather.
comment: http://bsdd.buildingsmart.org/#concept/details/2Iyg00qW4HuO00025QrE$V
label: Dach @de-de
label: Dak @nl
label: Tag @da
label: toiture @fr-fr

Barrel Roof
type: Class
subclass of: Roof
comment: http://bsdd.buildingsmart.org/#concept/details/172RLdein1b8WIbTtDLVbc

Butterfly Roof
type: Class
subclass of: Roof
comment: http://bsdd.buildingsmart.org/#concept/details/2W6yLK2r968h2TWfGC2xWu

Dome Roof
type: Class
subclass of: Roof
comment: http://bsdd.buildingsmart.org/#concept/details/3UcE2aJPP4ewOoRn29unfZ
label: kuppeltak @nb-no

Flat Roof
type: Class
subclass of: Roof
comment: http://bsdd.buildingsmart.org/#concept/details/3IeKrtrMz2SQN7qpJt82e5
label: flatt tak @nb-no

Free Form Roof
type: Class
subclass of: Roof
comment: http://bsdd.buildingsmart.org/#concept/details/2KVHvK7iXAEfKlD5hGIFEc
label: friform tak @nb-no

Gable Roof
type: Class
subclass of: Roof
comment: http://bsdd.buildingsmart.org/#concept/details/0gHJNRNhz6LOTHVbnW$nEj
label: gavl @nb-no

Gambrel Roof
type: Class
subclass of: Roof
comment: http://bsdd.buildingsmart.org/#concept/details/2BnDhKP1HF3vXxnwqccewa
label: gambrel tak @nb-no

Hipped Gable Roof
type: Class
subclass of: Roof
comment: http://bsdd.buildingsmart.org/#concept/details/3Su_2ncLX1Oes0r3fNr4uE
label: valm/saltak @nb-no

Hip Roof
type: Class
subclass of: Roof
comment: http://bsdd.buildingsmart.org/#concept/details/0waejMcyT3zwP6nRClvfSx
label: valmtak @nb-no

Mansard Roof
type: Class
subclass of: Roof
comment: http://bsdd.buildingsmart.org/#concept/details/1hB_MPg3j35vRsm_vutjD2
label: mansardtak @nb-no

Pavilion Roof
type: Class
subclass of: Roof
comment: http://bsdd.buildingsmart.org/#concept/details/11Ltv09Eb7lRJW184fZ9gF
label: paviljongtak @nb-no

Rainbow Roof
type: Class
subclass of: Roof
comment: http://bsdd.buildingsmart.org/#concept/details/1MnaPoqUb0L8PGqS6yHzbq
label: buetak @nb-no

Shed Roof
type: Class
subclass of: Roof
comment: http://bsdd.buildingsmart.org/#concept/details/3GsCyHvinDMPWmecHluOEq
label: pulttak @nb-no

Shading Device
type: Class
subclass of: Building Element
comment: Purpose built devices to protect from the sunlight, from natural light, or screening them from view. Shading devices can form part of the facade or can be mounted inside the building, they can be fixed or operable.
comment: http://bsdd.buildingsmart.org/#concept/details/11vQg0qWSHuO00025QrE$V
label: Afskærmningsanordning @da
label: Sonnenschutz festeingebaut @de-de
label: Zonnewering @nl
label: protection solaire @fr-fr
label: skjermingstype @nb-no

Awning
type: Class
subclass of: Shading Device
comment: a rooflike shelter of canvas or other material extending over a doorway, from the top of a window, over a deck, etc., in order to provide protection, as from the sun
comment: http://bsdd.buildingsmart.org/#concept/details/3NoPxSKmL7yQEzPT8cmssT
comment: product made of fabric/material, located externally, above, in front of, or within an opening and extending in a horizontal and/or sloping and/or vertical plane
comment: produkt laget av stoff/materiale som plasseres utvendig over, foran eller i en åpning, og som stikker ut i et horisontalt og/eller skrånende og/eller vertikalt plan @nb-no
label: Zonwering @nl-nl
label: markise @nb-no
label: solskjerming @nb-no

blinds
type: Class
subclass of: Shading Device
comment: Solavskjerming, Persienner @nb-no
comment: http://bsdd.buildingsmart.org/#concept/details/1$w9Dw6W9DJvD2GfuZFMSR
comment: http://bsdd.buildingsmart.org/#concept/details/3vHLsWoT0Hsm00051Mm008
comment: product consisting of horizontal slats which can be tilted. it may be retracted by raising and stacking the slats.
label: Jalousie
label: lamell @nb-no
label: persienne @nb-no
label: persienner @nb-no
label: sjalusi @nb-no
label: stores vénetiens @fr-fr
label: sun shading device
label: venetian blind

Shutter
type: Class
subclass of: Shading Device
comment: An artefact which is a part of an assembly that can be moved from a position where it permits contact, to a position where it becomes a part of the enclosure or partition shielding the fixed contacts.
comment: Movable component installed in an opening or duct to form a barrier for security purposes; used to control the passage of heat or light or to delay the spread of fire, smoke or gases.
comment: Solavskjerming, Solgardin @nb-no
comment: Sun-shading device
comment: http://bsdd.buildingsmart.org/#concept/details/0w_lVI8P10c9rjT$RsNEVr
comment: http://bsdd.buildingsmart.org/#concept/details/27f2fkTV50YwB1IZgMURLa
comment: http://bsdd.buildingsmart.org/#concept/details/3vHUzKoT0Hsm00051Mm008
comment: product installed either internally or externally to provide additional covering and/or protection to an opening
label: Abschluß @de-de
label: fermeture @fr-fr
label: markise @nb-no
label: skodde @nb-no
label: solgardin @nb-no

Slab
type: Class
subclass of: Building Element
comment: A component of the construction that normally encloses a space vertically. May provide the lower support (floor) or upper construction (roof slab) in any space in a building. Only the core or constructional part of this construction is considered to be a slab. The upper finish (flooring, roofing) and the lower finish (ceiling, suspended ceiling) are considered to be coverings.
comment: http://bsdd.buildingsmart.org/#concept/details/3pXDk0qWSHuO00025QrE$V
label: Decke / Dachfläche / Bodenplatte @de-de
label: Dæk @da
label: Plaat @nl
label: dalle @fr-fr
label: dekke @nb-no

Base Slab
type: Class
subclass of: Slab
comment: http://bsdd.buildingsmart.org/#concept/details/1hBroEIeL9neS3mSSGZiyC
label: støpt fundament @nb-no

Floor
type: Class
subclass of: Slab
comment: http://bsdd.buildingsmart.org/#concept/details/0jBALpJIv7vvlWkbd9HdCx
label: dekke @nb-no
label: gulv @nb-no

Landing
type: Class
subclass of: Slab
comment: http://bsdd.buildingsmart.org/#concept/details/3tQbZvvrfA8OUjU1kc2rUZ
label: repo @nb-no

Roof
type: Class
subclass of: Slab
comment: A covering of the top part of a building. Protects the building against the effects of weather.
comment: http://bsdd.buildingsmart.org/#concept/details/3Hvwx39_rCaRS49F4qRGBb
label: Dach @de-de
label: flatt tak @nb-no
label: toiture @fr-fr

Stair
type: Class
subclass of: Building Element
comment: A vertical passageway allowing occupants to walk (step) from one floor level to another floor level at a different elevation. May include a landing as an intermediate floor slab.
comment: http://bsdd.buildingsmart.org/#concept/details/3DhWM0qWmHuO00025QrE$V
label: Trap @nl
label: Trappe @da
label: Trapslag @nl-nl
label: Treppe @de-de
label: escalier @fr-fr
label: trapp @nb-no

Curved Run Stair
type: Class
subclass of: Stair
comment: a stair extending from one level to another without turns or winders. the stair is consisting of one curved flight.
comment: http://bsdd.buildingsmart.org/#concept/details/1lkxIX8Gj23Bi50H2qpZB9

Double Return Stair
type: Class
subclass of: Stair
comment: a stair having one straight flight to a wide quarterspace landing, and two side flights from that landing into opposite directions. the stair is making a 90° turn. the direction of traffic is determined by the walking line.
comment: http://bsdd.buildingsmart.org/#concept/details/3NNCQTceL7Uf8ZhJf40gs9

Half Turn Stair
type: Class
subclass of: Stair
comment: a stair making a 180° turn, consisting of two straight flights connected by a halfspace landing. the orientation of the turn is determined by the walking line.
comment: http://bsdd.buildingsmart.org/#concept/details/3YmaH1onP90PM6kEWHUjFv

Half Winding Stair
type: Class
subclass of: Stair
comment: http://bsdd.buildingsmart.org/#concept/details/0Vw081Hfz1AQne1V5CsfUA

Quarter Turn Stair
type: Class
subclass of: Stair
comment: a stair making a 90° turn, consisting of two straight flights connected by a quarterspace landing. the direction of the turn is determined by the walking line.
comment: http://bsdd.buildingsmart.org/#concept/details/1IEbbDJDHAFQb9SZweXH3x

Quarter Winding Stair
type: Class
subclass of: Stair
comment: http://bsdd.buildingsmart.org/#concept/details/3PzSNWl5T1EgMXH$Tn6uuQ

Spiral Stair
type: Class
subclass of: Stair
comment: http://bsdd.buildingsmart.org/#concept/details/0UwQe$TXP47AhE5k0mZzCe

Straight Run Stair
type: Class
subclass of: Stair
comment: http://bsdd.buildingsmart.org/#concept/details/3p4WSJmK96Oe6HXE$jmWWy

Three Quarter Turn Stair
type: Class
subclass of: Stair
comment: http://bsdd.buildingsmart.org/#concept/details/2jTG3NRNHCyhbsMbwK38v5

Three Quarter Winding Stair
type: Class
subclass of: Stair
comment: http://bsdd.buildingsmart.org/#concept/details/0rPjGYk_LFnOayZFsJg3tr

Two Curved Run Stair
type: Class
subclass of: Stair
comment: http://bsdd.buildingsmart.org/#concept/details/0cSo1dkGL8NunRzp$sQsTc

Two Quarter Turn Stair
type: Class
subclass of: Stair
comment: a stair making a 180° turn, consisting of three straight flights connected by two quarterspace landings. the direction of the turns is determined by the walking line
comment: http://bsdd.buildingsmart.org/#concept/details/0mW4DtraD3SA57fcejW4cS

Two Quarter Winding Stair
type: Class
subclass of: Stair
comment: http://bsdd.buildingsmart.org/#concept/details/3SSlfuJ_nA49lzIOhda6Xr

Two Straight Run Stair
type: Class
subclass of: Stair
comment: a straight stair consisting of two straight flights without turns but with one landing.
comment: http://bsdd.buildingsmart.org/#concept/details/3VuqGJNz160B87TSrFhrM4

Stair Flight
type: Class
subclass of: Building Element
comment: An assembly of building components in a single "run" of stair steps (not interrupted by a landing).
comment: http://bsdd.buildingsmart.org/#concept/details/0pceq0qWqHuO00025QrE$V
label: Volée d'escalier @fr-fr
label: trap @nl-nl
label: trapp @nb-no
label: trapslag @nl-nl
label: treppenlauf @de-de

Curved
type: Class
subclass of: Stair Flight
comment: http://bsdd.buildingsmart.org/#concept/details/2DeCDqEVHDjwFaGVpyNC89
label: trapp - kurvet @nb-no

Freeform
type: Class
subclass of: Stair Flight
comment: http://bsdd.buildingsmart.org/#concept/details/0uFuIDRO1EZPmcL8pEkVU$
label: friform @nb-no
label: friform tak @nb-no

Spiral
type: Class
subclass of: Stair Flight
comment: http://bsdd.buildingsmart.org/#concept/details/1zj3DVJij6IBVuIqOLbi46
label: scroll
label: spiral @nb-no
label: vindel @nb-no

Straight
type: Class
subclass of: Stair Flight
comment: http://bsdd.buildingsmart.org/#concept/details/247CeErMz16BZyRhwbAOdR
label: rett @nb-no

Winder
type: Class
subclass of: Stair Flight
comment: http://bsdd.buildingsmart.org/#concept/details/3XVLP1SZf8YQfshhp0Vjph
label: svingtrapp @nb-no

Tendon
type: Class
subclass of: Reinforcing Element
comment: a tendon is a steel element such as a wire, cable, bar, rod or strand used to impart prestress to concrete when the element is tensioned.
comment: http://bsdd.buildingsmart.org/#concept/details/0GEDRkhJ9DdQ2MRE_CaSCF
label: Spannglied @de-de
label: cable @fr-fr

Bar
type: Class
subclass of: Tendon
comment: http://bsdd.buildingsmart.org/#concept/details/3seMZXSSH4YfQCPjOcaoZG

Coated
type: Class
subclass of: Tendon
comment: http://bsdd.buildingsmart.org/#concept/details/1WLzEVaRD77A5KPd3$v9DB

Strand
type: Class
subclass of: Tendon
comment: http://bsdd.buildingsmart.org/#concept/details/1d4UrJXi92ivdu3FflJ62n

Wire
type: Class
subclass of: Tendon
comment: http://bsdd.buildingsmart.org/#concept/details/1NCnQvMs9AaRqwexu7DofF

Tendon Anchor
type: Class
subclass of: Reinforcing Element
comment: a tendon anchor is the end connection for tendons in prestressed or posttensioned concrete.
comment: http://bsdd.buildingsmart.org/#concept/details/0Z116ntsH6xBFYGYsNg38f
label: Spanngliedanker @de-de
label: ancrage @fr-fr

Coupler
type: Class
subclass of: Tendon Anchor
comment: http://bsdd.buildingsmart.org/#concept/details/2yrjArQAnBL9EdTqIc7Uv7

Fixed End
type: Class
subclass of: Tendon Anchor
comment: http://bsdd.buildingsmart.org/#concept/details/133YYoKAv8mBxccTJtzWju

Tensioning End
type: Class
subclass of: Tendon Anchor
comment: http://bsdd.buildingsmart.org/#concept/details/2Bp8P7qwn1Hg1BaRHyCQP4

Transport Element
type: Class
subclass of: Element Component
comment: A generalization of all transport related objects that move people, animals or goods within a building or building complex. Include elevator (lift), escalator, moving walkway, etc.
comment: An element type defined by commonly shared information for occurrences of transport elements. The set of shared information may include: common properties within shared property sets common material information common shape representations It is used to define a transport element specification (i.e. the specific product information that is common to all occurrences of that beam type).
comment: http://bsdd.buildingsmart.org/#concept/details/3ZSVc0qX4HuO00025QrE$V
label: Beförderungsgerät @de-de
label: Equipement de transport @fr-fr
label: transportelement @nb-no

Craneway
type: Class
subclass of: Transport Element
comment: An artefact for raising, shifting and lowering heavy weights by means of a projecting swinging arm or with hoisting mechanism supported on an overhead track.
comment: a crane way system, normally including the crane rails, fasteners and the crane. it is primarily used to move heavy goods in a factory or other industry buildings
comment: http://bsdd.buildingsmart.org/#concept/details/087V4aTMPA09OItHDUip4G
label: kran @nb-no
label: kranbane @nb-no

Elevator
type: Class
subclass of: Transport Element
comment: a permanent lifting equipment serving defined landing levels, comprising a car, whose dimensions and means of construction clearly permit the access of persons; running at least partially between rigid vertical guides or guides whose inclination to the ve
comment: http://bsdd.buildingsmart.org/#concept/details/2qanav0WDASA8V5to62fCx
comment: http://bsdd.buildingsmart.org/#concept/details/3vHX1_oT0Hsm00051Mm008
comment: permanent løfteutstyr som betjener definerte etasjenivåer, og som består av en stol hvis dimensjoner og konstruksjonsmåte klart gir adgang for personer, og som minst delvis beveger seg mellom stive, vertikale føringsskinner eller føringer hvor hellingen f @nb-no
label: Aufzug @de-de
label: ascenseur @fr-fr
label: heis @nb-no
label: lift

Escalator
type: Class
subclass of: Transport Element
comment: http://bsdd.buildingsmart.org/#concept/details/377eo0WJOHu000025QrE$V
comment: http://bsdd.buildingsmart.org/#concept/details/3vHZncoT0Hsm00051Mm008
comment: power-driven, inclined, continuous moving stairway used for raising or lowering persons in which the user carrying surface (e.g. steps) remains horizontal
label: Fahrtreppe @de-de
label: Roltrap @nl-nl
label: escalier roulant @fr-fr
label: rulletrapp @nb-no

Lifting Gear
type: Class
subclass of: Transport Element
comment: a device used for lifting or lowering heavy goods. It may be manually operated or electrically or pneumatically driven
comment: http://bsdd.buildingsmart.org/#concept/details/3qsVNaK3r6Uw2tccQdpTmo
label: løfteinretning @nb-no

Moving Walkway
type: Class
subclass of: Transport Element
comment: http://bsdd.buildingsmart.org/#concept/details/0Fn7lcsC5As81fnfma0hsy
label: rullebånd @nb-no

Vibration Isolator
type: Class
subclass of: Element Component
comment: A device used to minimize the effects of vibration transmissibility in a building.
comment: http://bsdd.buildingsmart.org/#concept/details/0Oy60xvFT7TO70hyDzhWWZ
label: Schwingungsisolator @de-de
label: isolateur de vibrations @fr-fr
label: isolation anti-vibratoire @fr-fr
label: trillingsisolator @nl-nl
label: vibrasjonsisolator @nb-no

Compression-based vibration isolator
type: Class
subclass of: Vibration Isolator
comment: compression type vibration isolator
comment: http://bsdd.buildingsmart.org/#concept/details/0EwSGR8PX1z9zHS_KHBRcA
label: kompresjon @nb-no

Spring
type: Class
subclass of: Vibration Isolator
comment: http://bsdd.buildingsmart.org/#concept/details/3cKim0GJf3mxz7EqVVfQ8u
comment: spring type vibration isolator
label: fjær @nb-no

Wall
type: Class
subclass of: Building Element
comment: A vertical construction that bounds or subdivides spaces. Usually vertical, or nearly vertical, planar elements, often designed to bear structural loads. However not required to be load bearing.
comment: http://bsdd.buildingsmart.org/#concept/details/2Xuqs0qXKHuO00025QrE$V
label: Muur @nl
label: Væg @da
label: Wand @de-de
label: mur @fr-fr
label: vegg @nb-no
label: wall

Elemented Wall
type: Class
subclass of: Wall
comment: a stud wall framed with studs and faced with sheetings, sidings, wallboard, or plasterwork
comment: http://bsdd.buildingsmart.org/#concept/details/0sVBQjaqvEcAVsdRJorFkQ
label: elementvegg @nb-no
label: systemvegg @nb-no

Movable Wall
type: Class
subclass of: Wall
comment: http://bsdd.buildingsmart.org/#concept/details/2nSQnTH_18RB$MO5daYxD0
label: Flyttbar @nb-no

Parapet Wall
type: Class
subclass of: Wall
comment: Parapet/brystning Opphøyet kant som stikker opp over tak @nb-no
comment: http://bsdd.buildingsmart.org/#concept/details/1uS$40WJmHu000025QrE$V
comment: http://bsdd.buildingsmart.org/#concept/details/2BlEUUV2L2BBUdnPO3PtnQ
label: Balustrade @nl-nl
label: Borstwering @nl-nl
label: balustrade
label: parapet

Partitioning Wall
type: Class
subclass of: Wall
comment: http://bsdd.buildingsmart.org/#concept/details/3DBpG2jff4GAXiQp8trskt
label: skillevegg @nb-no

Plumbing Wall
type: Class
subclass of: Wall
comment: http://bsdd.buildingsmart.org/#concept/details/1YFt0DFB99uxbJnz4oFiew
label: rør i vegg @nb-no

Polygonal Wall
type: Class
subclass of: Wall
comment: a polygonal wall, extruded vertically, where the wall thickness varies along the wall path
comment: http://bsdd.buildingsmart.org/#concept/details/0cJEMJHYj6Hh7Q1xNPsiIf
label: mangekantet @nb-no

Shear Wall
type: Class
subclass of: Wall
comment: http://bsdd.buildingsmart.org/#concept/details/0MAk1miOTAJQpI0VGyMnjS
label: skive @nb-no

Solid Wall
type: Class
subclass of: Wall
comment: http://bsdd.buildingsmart.org/#concept/details/2J1xt_ADz7heqvTyh5YGEM
label: massiv vegg @nb-no

Standard Wall
type: Class
subclass of: Wall
comment: http://bsdd.buildingsmart.org/#concept/details/2HWHt8Yiz4m9UzhlqVFLeO

Elemented Wall Case
type: Class
subclass of: Wall
comment: A wall with certain constraints for the provision of its components.
comment: http://bsdd.buildingsmart.org/#concept/details/2dG9W0qXKHuO00025QrE$V
label: Mur composite @fr-fr
label: Wand elementiert @de-de

Window
type: Class
subclass of: Building Element
comment: Abertura destinada a iluminar e ventilar os ambientes internos, além de facilitar a visão do exterior. @pt-br
comment: Bauteil zum Schließen einer Öffnung in einer Wand oder Satteldach, das Licht durchlassen und Belüftung ermöglichen kann @de-de
comment: building component for closing an opening in a wall or pitched roof that will admit light and may provide ventilation
comment: byggelement som används för att stänga en öppning i en vägg eller ett sadeltak som kan släppa in ljus och bidra med ventilation @sv-se
comment: componente costruttivo atto a chiudere un'apertura in un muro o in un tetto a spiovente che ammetta la luce e possa fornire ventilazione @it-it
comment: componente de construcción para cerrar una abertura en una pared o techo a dos aguas que deja pasar la luz y puede proporcionar ventilación @es-es
comment: construction for closing a vertical or near-vertical opening in a wall or pitched roof which will admit light and may provide ventilation. Often a pane of glass framed and mounted to permit opening and closing
comment: ein konstruksjon som står i ei opning som i ein vegg eller tak og som normalt er dekt av glas, med det føremålet å sleppa inn lys og luft. | konstruksjon for *lukking av ein vertikal eller nesten vertikal opning i ein vegg eller eit skråtak som skal sleppa igjennom lys kan gje ventilasjon. Ofte ei glasrute *innrammet og montert for å gjera muleg opning og lukking @nn-no
comment: element budynku służący do zamykania i otwierania, osadzony w ścianie lub w dachu dwuspadowym, przepuszczający światło i mogący zapewniać wentylację @pl-pl
comment: en konstruksjon som står i en åpning som i en vegg eller tak og som normalt er dekket av glass, med det formål å slippe inn lys og luft. @nb-no
comment: http://bsdd.buildingsmart.org/#concept/details/3vHUaooT0Hsm00051Mm008
comment: konstruksjon for lukking av en vertikal eller nesten vertikal åpning i en vegg eller et skråtak som skal slippe igjennom lys kan gi ventilasjon. Ofte en glassrute innrammet og montert for å muliggjøre åpning og lukking @nb-no
comment: konstruktion til lukning af en lodret eller næsten lodret åbning i en mur eller skråt tag, der lader lys trænge igennem og kan muliggøre ventilation. Ofte en rude i en karm og monteret, så den kan åbnes og lukkes @dk-dk
comment: seinä- tai kattoaukon sulkeva, valoa läpipäästävä rakenneosa varustettuna mahdollisin ilmanvaihto-ominaisuuksin @fi-fi
comment: une construction destinée à fermer une ouverture verticale ou quasi-verticale dans un mur ou un toit en pente qui laissera passer la lumière et pourra fournir une ventilation. souvent constituée d'un panneau vitré monté sur un châssis permettant son ouverture et sa fermeture. @fr-fr
comment: строителен компонент за затваряне на отвор в стена или скатен покрив, който служи за осветяване и евентуално за проветряване @bg-bg
label: Fenster @de-de
label: Raam @nl
label: Vindue @da
label: fenêtre @fr-fr
label: finestra @it-it
label: fönster @sv-se
label: ikkuna @fi-fi
label: janela @pt-br
label: okna @pl-pl
label: ventana @es-es
label: vindauge @nn-no
label: vindu @nb-no
label: vindue @dk-dk
label: window
label: windowset
label: прозорец @bg-bg
label: نافذة @ar-sa
label: 窓 @ja-jp

Light dome
type: Class
subclass of: Window
comment: a special window that lies horizonally in a roof slab opening
comment: http://bsdd.buildingsmart.org/#concept/details/3aXmro5wX3FeEqYU7Y7w5X
label: lyskuppel @nb-no

Skylight
type: Class
subclass of: Window
comment: Overlys @nb-no
comment: construction for closing an opening in a flat roof or low pitched roof, intended primarily for lighting and consisting of a frame and glazing
comment: http://bsdd.buildingsmart.org/#concept/details/1irgDncIrAVQwjja3JEbnb
label: Daklicht @nl-nl
label: overlys @nb-no

Window
type: Class
subclass of: Window
comment: A building element that is predominately used to provide natural light and fresh air. It includes vertical opening but also horizontal opening such as skylights or light domes. It includes constructions with swinging, pivoting, sliding, or revolving panels and fixed panels. A window consists of a lining and one or several panels. NOTE Definition according to ISO 6707-1 Construction for closing a vertical or near vertical opening in a wall or pitched roof that will admit light and may admit fresh air. @ifc-2x4
comment: Abertura destinada a iluminar e ventilar os ambientes internos, além de facilitar a visão do exterior. @pt-br
comment: Bauteil zum Schließen einer Öffnung in einer Wand oder Satteldach, das Licht durchlassen und Belüftung ermöglichen kann @de-de
comment: Een raam is een constructie met een scheidingsfunctie en een lichttoetredingsfunctie. @nl-nl
comment: building component for closing an opening in a wall or pitched roof that will admit light and may provide ventilation
comment: byggelement som används för att stänga en öppning i en vägg eller ett sadeltak som kan släppa in ljus och bidra med ventilation @sv-se
comment: componente costruttivo atto a chiudere un'apertura in un muro o in un tetto a spiovente che ammetta la luce e possa fornire ventilazione @it-it
comment: componente de construcción para cerrar una abertura en una pared o techo a dos aguas que deja pasar la luz y puede proporcionar ventilación @es-es
comment: construction for closing a vertical or near-vertical opening in a wall or pitched roof which will admit light and may provide ventilation. Often a pane of glass framed and mounted to permit opening and closing
comment: ein konstruksjon som står i ei opning som i ein vegg eller tak og som normalt er dekt av glas, med det føremålet å sleppa inn lys og luft. | konstruksjon for *lukking av ein vertikal eller nesten vertikal opning i ein vegg eller eit skråtak som skal sleppa igjennom lys kan gje ventilasjon. Ofte ei glasrute *innrammet og montert for å gjera muleg opning og lukking @nn-no
comment: element budynku służący do zamykania i otwierania, osadzony w ścianie lub w dachu dwuspadowym, przepuszczający światło i mogący zapewniać wentylację @pl-pl
comment: en konstruksjon som står i en åpning som i en vegg eller tak og som normalt er dekket av glass, med det formål å slippe inn lys og luft. @nb-no
comment: http://bsdd.buildingsmart.org/#concept/details/3QkFVA4cD3YvP3Y3zVGFc3
comment: konstruksjon for lukking av en vertikal eller nesten vertikal åpning i en vegg eller et skråtak som skal slippe igjennom lys kan gi ventilasjon. Ofte en glassrute innrammet og montert for å muliggjøre åpning og lukking @nb-no
comment: konstruktion til lukning af en lodret eller næsten lodret åbning i en mur eller skråt tag, der lader lys trænge igennem og kan muliggøre ventilation. Ofte en rude i en karm og monteret, så den kan åbnes og lukkes @dk-dk
comment: objekt för tillträde till utrymme för enbart ljus @sv-se
comment: seinä- tai kattoaukon sulkeva, valoa läpipäästävä rakenneosa varustettuna mahdollisin ilmanvaihto-ominaisuuksin @fi-fi
comment: space access object for light entry only
comment: une construction destinée à fermer une ouverture verticale ou quasi-verticale dans un mur ou un toit en pente qui laissera passer la lumière et pourra fournir une ventilation. souvent constituée d'un panneau vitré monté sur un châssis permettant son ouverture et sa fermeture. @fr-fr
comment: строителен компонент за затваряне на отвор в стена или скатен покрив, който служи за осветяване и евентуално за проветряване @bg-bg
label: Fenster @de-de
label: Raam @nl-nl
label: fenster @de-ch
label: fenêtre @fr-fr
label: finestra @it-it
label: fönster @sv-se
label: ikkuna @fi-fi
label: janela @pt-br
label: okna @pl-pl
label: ventana @es-es
label: vindauge @nn-no
label: vindu @nb-no
label: vindue @dk-dk
label: window
label: прозорец @bg-bg
label: نافذة @ar-sa
label: 窓 @ja-jp

Pieter Pauwels
type: Person

Pieter Pauwels
type: Person

Pieter Pauwels
type: Person

Pieter Pauwels
type: Person