Distribution Element Ontology
type: Ontology
language: en
description: The Distribution Element Ontology provides an ontology based on the IfcDistributionElement subtree in the IFC specification, containing a taxonomy of classes that allow to define common distribution elements (actuators, flowterminals, ...).
modified: January 28th 2019
issued: 2019-01-28
license: https://creativecommons.org/licenses/by/1.0/
preferred namespace prefix: mep
preferred namespace uri: https://buildingsmart.org/ifc4-voc/distributionelement#
version info: January 28th 2019
version info: v0.1.0

Actuator
type: Class
subclass of: Distribution Control Element
comment: A mechanical device for moving or controlling a mechanism or system. An actuator takes energy, usually created by air, electricity, or liquid, and converts that into some kind of motion.
comment: An artefact intended to convert energy (electric, pneumatic, hydraulic) from an external source to kinetic energy in response to a signal..
comment: http://bsdd.buildingsmart.org/#concept/details/14RHCzJ6j6MOcOYy1uRfnX
label: actionneur @fr-fr
label: aktor @de-de
label: aktuator @nb-no
label: antrieb @de-de
label: appareillage de commande @fr-fr
label: utløser @nb-no

Electric Actuator
type: Class
subclass of: Actuator
comment: a device that electrically actuates a control element
comment: http://bsdd.buildingsmart.org/#concept/details/0_R289D0r6oPsUChqMMWr1
label: elektrisk aktuator @nb-no

Hand-Operated Actuator
type: Class
subclass of: Actuator
comment: http://bsdd.buildingsmart.org/#concept/details/0FuSpPYcbBcAKNNq77IEUN

Hydraulic Actuator
type: Class
subclass of: Actuator
comment: http://bsdd.buildingsmart.org/#concept/details/23inrfSJTEjPmdb42m6RPS

Pneumatic Actuator
type: Class
subclass of: Actuator
comment: http://bsdd.buildingsmart.org/#concept/details/1An85fZE5EZuDCIYomL2WH

Thermostatic Actuator
type: Class
subclass of: Actuator
comment: http://bsdd.buildingsmart.org/#concept/details/3dkx9QS9HB_emzU3ErhfqY

Air Terminal
type: Class
subclass of: Flow Terminal
comment: A terminal terminating or origination point for the transfer of air between distribution system(s) and one or more spaces. It can also be used for the transfer of air between adjacent spaces.
comment: http://bsdd.buildingsmart.org/#concept/details/3ydOg0qRuHuO00025QrE$V
label: Luftauslass @de-de
label: entrée ou sortie d'air @fr-fr
label: ventilasjonsterminal @nb-no

Diffuser
type: Class
subclass of: Air Terminal
comment: http://bsdd.buildingsmart.org/#concept/details/1FTT5hVkDA$QvjrFJNJEnI
label: luftterminal - diffusor @nb-no

Grille
type: Class
subclass of: Air Terminal
comment: a covering for any area through which air passes.
comment: http://bsdd.buildingsmart.org/#concept/details/2hjaxvDcLE49ehxXYke964
label: gitter @nb-no
label: grille @fr-fr

Louvre
type: Class
subclass of: Air Terminal
comment: a rectilinear louvre.
comment: http://bsdd.buildingsmart.org/#concept/details/0cCEo7qnfDSgG93nJsd3eQ
label: rist @nb-no

Register
type: Class
subclass of: Air Terminal
comment: a grille typically equipped with a damper or control valve.
comment: http://bsdd.buildingsmart.org/#concept/details/3PWMnCjqP5peD0PtO2aiy5
label: register @nb-no

Air Terminal Box
type: Class
subclass of: Flow Controller
comment: A terminal box in an HVAC duct distribution system and is used to control or modulate the amount of air delivered to its downstream ductwork. Often referred to as an 'air flow regulator'.
comment: http://bsdd.buildingsmart.org/#concept/details/0zPqWPJST5LRtUuSJBlWpM
label: Diffuseur d'air @fr-fr
label: Volumenstromregler @de-de
label: plenumskammer @nb-no

Constant Flow Air Terminal Box
type: Class
subclass of: Air Terminal Box
comment: http://bsdd.buildingsmart.org/#concept/details/0dsGGCiP10ouwdibwvCd4F

Variable Flow Pressure Dependent Air Terminal Box
type: Class
subclass of: Air Terminal Box
comment: http://bsdd.buildingsmart.org/#concept/details/2EJZMcPDLDIvG04WI9UZaC

Variable Flow Pressure Independent Air Terminal Box
type: Class
subclass of: Air Terminal Box
comment: http://bsdd.buildingsmart.org/#concept/details/2zgc7TxXP2igAw6tyDqxcB

Air-to-Air Heat Recovery
type: Class
subclass of: Energy Conversion Device
comment: A counter-flow heat exchanger between inbound and outbound air flow. Typically used to transfer heat from warmer air in one chamber to cooler air in the second chamber (i.e., typically used to recover heat from the conditioned air being exhausted and the outside air being supplied to a building), resulting in energy savings from reduced heating (or cooling) requirements.
comment: http://bsdd.buildingsmart.org/#concept/details/2NT_DsArH7_Q5msK_YfU$N
label: Echangeur air-air @fr-fr
label: Wärmerückgewinner @de-de
label: luft/luft-varmegjenvinningsanlegg @nb-no

Fixed-Plate Counter-Flow Exchanger
type: Class
subclass of: Air-to-Air Heat Recovery
comment: heat exchanger with moving parts and alternate layers of plates, separated and sealed from the exhaust and supply air stream passages with primary air entering at secondary air outlet location and exiting at secondary air inlet location
comment: http://bsdd.buildingsmart.org/#concept/details/32kk64JBbDDPM$6p$uBj_5
label: fast plate motstrømsveksler @nb-no

Fixed-Plate Cross-Flow Exchanger
type: Class
subclass of: Air-to-Air Heat Recovery
comment: http://bsdd.buildingsmart.org/#concept/details/2LTpG80kz5Oh41Z0r9nlld
comment: not available

Fixed-Plate Parallel-Flow Exchanger
type: Class
subclass of: Air-to-Air Heat Recovery
comment: http://bsdd.buildingsmart.org/#concept/details/2miQYyrOfDkQ3LRDmm98s2

Heat Pipe
type: Class
subclass of: Air-to-Air Heat Recovery
comment: a passive energy recovery device with a heat pipe divided into evaporator and condenser sections
comment: http://bsdd.buildingsmart.org/#concept/details/3g4XqNsbDCXxINl9l4yi1C
label: varmerør @nb-no

Rotary Wheel
type: Class
subclass of: Air-to-Air Heat Recovery
comment: a heat wheel with a revolving cylinder filled with an air-permeable medium having a large internal surface area
comment: http://bsdd.buildingsmart.org/#concept/details/1jrV4bYDD3JfDdNo49vivZ
label: dreiehjul @nb-no

Run-Around Coil Loop
type: Class
subclass of: Air-to-Air Heat Recovery
comment: http://bsdd.buildingsmart.org/#concept/details/2cqFu4yIn4g8zaq7Ari71H

Thermosiphon Coil-Type Heat Exchangers
type: Class
subclass of: Air-to-Air Heat Recovery
comment: http://bsdd.buildingsmart.org/#concept/details/1tRIVmPDzFEwR3BpMALcZq

Thermosiphon Sealed-Tube Heat Exchanger
type: Class
subclass of: Air-to-Air Heat Recovery
comment: http://bsdd.buildingsmart.org/#concept/details/3sRN7JNafC$OyVXS$9WPxV

Twin Tower Enthalpy Recovery Loop
type: Class
subclass of: Air-to-Air Heat Recovery
comment: http://bsdd.buildingsmart.org/#concept/details/0LF0EN7b17KRgoO5lIZDTY

Alarm
type: Class
subclass of: Distribution Control Element
comment: device, which may be connected into a transmission path of a fire detection and fire alarm system, to limit the consequences of low parallel resistance faults between the lines of this transmission path
comment: http://bsdd.buildingsmart.org/#concept/details/1lb9XO$N58HxZ1Bunuwfkb
label: brannalarm - kortslutningsisolator @nb-no

Bell
type: Class
subclass of: Alarm
comment: an audible alarm
comment: http://bsdd.buildingsmart.org/#concept/details/2iAce1_ub4pRT_gbGydGqi
label: bjelle @nb-no

Break Glass Button
type: Class
subclass of: Alarm
comment: an alarm activation mechanism in which a protective glass has to be broken to enable a button to be pressed
comment: http://bsdd.buildingsmart.org/#concept/details/1PccK35QXEef9_Kn79zIxl
label: brannvarslingsknapp @nb-no

Light
type: Class
subclass of: Alarm
comment: a visual alarm
comment: http://bsdd.buildingsmart.org/#concept/details/3S8_P1o2L01Ozx8doI6nGk
label: Licht @de-de
label: lys @nb-no

Manual Pullbox
type: Class
subclass of: Alarm
comment: http://bsdd.buildingsmart.org/#concept/details/3zt85EwTXD_QTso9MWvKcg
label: manuell trekkeboks @nb-no

Siren
type: Class
subclass of: Alarm
comment: an audible alarm
comment: http://bsdd.buildingsmart.org/#concept/details/1UTy6cbg964OXOMBBCXymq
label: sirene @nb-no

Whistle
type: Class
subclass of: Alarm
comment: an audible alarm
comment: http://bsdd.buildingsmart.org/#concept/details/2AoyxzFcb3MB1ULS_ZzZZX
label: fløyte @nb-no

Audio Visual Appliance
type: Class
subclass of: Flow Terminal
comment: A device that displays, captures, transmits, or receives audio or video. Audio-visual appliances may be fixed in place or may be able to be moved from one space to another. They may require an electrical supply that may be supplied either by an electrical circuit or provided from a local battery source. Audio-visual appliances may be connected to data circuits including specialist circuits for audio visual purposes only.
comment: http://bsdd.buildingsmart.org/#concept/details/2ZaJrCZM56p8CnFEqtkRj5
label: appareil audiovisuel @fr-fr
label: audiovisuell enheten @nb-no
label: audiovisuelles Gerät @de-de

Amplifier
type: Class
subclass of: Audio Visual Appliance
comment: device for boosting audio signal power by means of auxiliary power
comment: http://bsdd.buildingsmart.org/#concept/details/3wRrr4McP2IPDX2xDHWMb5
label: forsterker @nb-no

Camera
type: Class
subclass of: Audio Visual Appliance
comment: a device that records images, either as a still photograph or as moving images known as videos or movies. Note that a camera may operate with light from the visible spectrum or from other parts of the electromagnetic spectrum such as infrared or ultraviolet.
comment: http://bsdd.buildingsmart.org/#concept/details/0Iits$HO92OhljjIcBPane
label: kamera @nb-no

Display
type: Class
subclass of: Audio Visual Appliance
comment: an electronic device that represents information in visual form such as a flat-panel display or television.
comment: http://bsdd.buildingsmart.org/#concept/details/3zbk7NQJzCte2YLviWyYiT
label: viser @nb-no

Microphone
type: Class
subclass of: Audio Visual Appliance
comment: an instrument for converting sound waves into electrical energy variations which may then be amplified, transmitted, or recorded
comment: http://bsdd.buildingsmart.org/#concept/details/2L42aAWJmHu000025QrE$V
label: Microfoon @nl-nl
label: mikrofon @nb-no

Player
type: Class
subclass of: Audio Visual Appliance
comment: a device for playing recorded music
comment: http://bsdd.buildingsmart.org/#concept/details/3eOLloUdbACBmRDqUZRsWN
label: avspiller @nb-no

Projector
type: Class
subclass of: Audio Visual Appliance
comment: a device that is used to project rays of light, especially an apparatus with a system of lenses for projecting slides or film on to a screen
comment: http://bsdd.buildingsmart.org/#concept/details/3PFxyF66H6Awpa8qVklE0D
label: prosjektor @nb-no

Receiver
type: Class
subclass of: Audio Visual Appliance
comment: http://bsdd.buildingsmart.org/#concept/details/0f5ylhxBD1hxZPMi642Cwa
comment: the part of a telephone apparatus contained in the earpiece, in which electrical signals are converted into sounds
label: mottaker @nb-no

Speaker
type: Class
subclass of: Audio Visual Appliance
comment: an apparatus that converts electrical impulses into sound, typically as part of a public address system
comment: http://bsdd.buildingsmart.org/#concept/details/3VXQt2hgT5iRydKNBGNLUm
label: haut-parleur @fr-fr
label: høytaler @nb-no
label: høyttaler @nb-no

Switcher
type: Class
subclass of: Audio Visual Appliance
comment: a piece of electronic equipment used to select or combine different video and audio signals
comment: http://bsdd.buildingsmart.org/#concept/details/15RfXB4Cf9VOzccs$seVij
label: bryter @nb-no

Telephone
type: Class
subclass of: Audio Visual Appliance
comment: http://bsdd.buildingsmart.org/#concept/details/3LvBfsxh5A9OLMJxpzp_5P
label: telefon @nb-no

Tuner
type: Class
subclass of: Audio Visual Appliance
comment: an electronic device for varying the frequency to which a radio or television is tuned
comment: http://bsdd.buildingsmart.org/#concept/details/0sGM9efvTEy8OclWcCNG6k
label: tuner @nb-no

Boiler
type: Class
subclass of: Energy Conversion Device
comment: A closed, pressure-rated vessel in which water or other fluid is heated using an energy source such as natural gas, heating oil, or electricity.
comment: http://bsdd.buildingsmart.org/#concept/details/2n42GxcQv3ZeE_LK7_FaP7
label: Chaudière @fr-fr
label: Heizkessel @de-de
label: Warmwater voorraadtoestel @nl-nl
label: Warmwatertoestel @nl-nl
label: kjel @nb-no
label: water boiler

Steam Boiler
type: Class
subclass of: Boiler
comment: The amount of steam consumed during the period specified in the time series. @ifc-2x4
comment: http://bsdd.buildingsmart.org/#concept/details/3r3yMQaETCj9yTgeFnY6eO
label: dampkjel @nb-no

Water Boiler
type: Class
subclass of: Boiler
comment: http://bsdd.buildingsmart.org/#concept/details/3vHZlaoT0Hsm00051Mm008

Burner
type: Class
subclass of: Energy Conversion Device
comment: A device that converts fuel into heat through combustion.
comment: http://bsdd.buildingsmart.org/#concept/details/3eaWqihr5FfBQB2Eu0SSfd
label: Brenner @de-de
label: Brûleur @fr-fr
label: brenner @nb-no

Cable Carrier Fitting
type: Class
subclass of: Flow Fitting
comment: A fitting that is placed at junction or transition in a cable carrier system.
comment: http://bsdd.buildingsmart.org/#concept/details/1UxFU0Z7L3wgssm2xurkpg
label: Kabelträger Passstück @de-de
label: Raccord de chemin de cable @fr-fr
label: kabelføringskobling @nb-no

Bend
type: Class
subclass of: Cable Carrier Fitting
comment: a fitting that changes the route of the cable carrier.
comment: http://bsdd.buildingsmart.org/#concept/details/02T1S3SGrDMBMfyCIF7X4E
label: bend @nb-no

Cross
type: Class
subclass of: Cable Carrier Fitting
comment: a fitting at which two branches are taken from the main route of the cable carrier simultaneously.
comment: http://bsdd.buildingsmart.org/#concept/details/0Nz$21cnn4VwLtD25_Kdcr
label: kryss @nb-no

Reducer
type: Class
subclass of: Cable Carrier Fitting
comment: http://bsdd.buildingsmart.org/#concept/details/3$DOQ8x9jEFehexpevTRMs
label: reduksjon @nb-no

Tee
type: Class
subclass of: Cable Carrier Fitting
comment: a fitting at which a branch is taken from the main route of the cable carrier.
comment: http://bsdd.buildingsmart.org/#concept/details/2qYrhIwZ1BQgGx_wwRrFAA
label: T-rør @nb-no

Cable Carrier Segment
type: Class
subclass of: Flow Segment
comment: A flow segment that is specifically used to carry and support cabling.
comment: http://bsdd.buildingsmart.org/#concept/details/0wEcZCe1zEsO4LVirAd0ZF
label: Kabelträgersegment @de-de
label: Segment de chemin de cable @fr-fr
label: kabelføringssegment @nb-no

Cable Ladder Segment
type: Class
subclass of: Cable Carrier Segment
comment: http://bsdd.buildingsmart.org/#concept/details/0FImfTYGb48ursCbLXsTCr

Cable Tray Segment
type: Class
subclass of: Cable Carrier Segment
comment: http://bsdd.buildingsmart.org/#concept/details/3t8hY0ZCvEj8gC2KrGLxGu

Cable Trunk Segment
type: Class
subclass of: Cable Carrier Segment
comment: http://bsdd.buildingsmart.org/#concept/details/0bkSD8Eh1ByuLzjMf5xfTq

Conduit Segment
type: Class
subclass of: Cable Carrier Segment
comment: http://bsdd.buildingsmart.org/#concept/details/3MuSnBn2PFkfAY3gBeVAlk

Cable Fitting
type: Class
subclass of: Flow Fitting
comment: A fitting that is placed at a junction, transition or termination in a cable system.
comment: http://bsdd.buildingsmart.org/#concept/details/27LUFoJu97RuNCAIoglvnW
label: Kabelverbinder @de-de
label: Kabelverbinder - Typ @de-de

Connector
type: Class
subclass of: Cable Fitting
comment: a device for keeping two parts of an electric circuit in contact
comment: http://bsdd.buildingsmart.org/#concept/details/1xjOGZ4kX1g8pvaS5Bd5bG
label: connecteur @fr-fr
label: forbindelse @nb-no

Entry
type: Class
subclass of: Cable Fitting
comment: a fitting that begins a cable segment at a non-electrical element such as a grounding clamp attached to a pipe
comment: http://bsdd.buildingsmart.org/#concept/details/07gAPw_U1EguTzO5UilotA
label: inngang @nb-no

Exit
type: Class
subclass of: Cable Fitting
comment: http://bsdd.buildingsmart.org/#concept/details/1_YaBIQW905QZ9AjtoPTNy
label: utgang @nb-no

Junction
type: Class
subclass of: Cable Fitting
comment: a fitting that joins three or more segments of arbitrary connector types for signal splitting or multiplexing.
comment: http://bsdd.buildingsmart.org/#concept/details/1RPq5LwjT7VwBv_u4OjJrf
label: gren @nb-no

Transition
type: Class
subclass of: Cable Fitting
comment: http://bsdd.buildingsmart.org/#concept/details/2H3YKfRzn2u9Nog81SAl8k
label: overgang @nb-no

Cable Segment
type: Class
subclass of: Flow Segment
comment: A flow segment used to carry electrical power, data, or telecommunications signals.
comment: http://bsdd.buildingsmart.org/#concept/details/26thIKCK1FhfE8oeEPRbVn
label: Kabelsegment @de-de
label: Segment de câble @fr-fr

Busbar Segment
type: Class
subclass of: Cable Segment
comment: http://bsdd.buildingsmart.org/#concept/details/0uFCFVhl53Re8TGtNoQbaU

Conductor Segment
type: Class
subclass of: Cable Segment
comment: http://bsdd.buildingsmart.org/#concept/details/2dlPSgGMHCnu9mfLG8gZtL

Core Segment
type: Class
subclass of: Cable Segment
comment: http://bsdd.buildingsmart.org/#concept/details/2AYnQG0vTDUwn_LR9znomO

Chiller
type: Class
subclass of: Energy Conversion Device
comment: A device used to remove heat from a liquid via a vapor-compression or absorption refrigeration cycle to cool a fluid, typically water or a mixture of water and glycol.
comment: http://bsdd.buildingsmart.org/#concept/details/1Zpzuw4lf8p9CkbZR8gJou
label: Kältemaschine @de-de
label: Refroidisseur @fr-fr
label: kjøler @nb-no
label: kylare @sv-se
label: refrigeratore @it-it

Air-Cooled Chiller
type: Class
subclass of: Chiller
comment: air cooled chiller
comment: http://bsdd.buildingsmart.org/#concept/details/0Tmp5umYX80uDxxCJQrW$a
label: luftkjølt kjøler @nb-no

Heat Recovery Chiller
type: Class
subclass of: Chiller
comment: heat recovery chiller.
comment: http://bsdd.buildingsmart.org/#concept/details/30ALQiOHn5LetyiGCdujt6
label: varmegjenvinning @nb-no

Water-Cooled Chiller
type: Class
subclass of: Chiller
comment: http://bsdd.buildingsmart.org/#concept/details/1$b15itWrEVeOmpk8LNP3I
comment: water cooled chiller
label: vannkjølt @nb-no

Coil
type: Class
subclass of: Energy Conversion Device
comment: A device used to provide heat transfer between non-mixing media.
comment: http://bsdd.buildingsmart.org/#concept/details/1reT_0qSaHuO00025QrE$V
label: Bobine @fr-fr
label: Flade @da
label: Heiz-Kühlelemente @de-de
label: spoletype @nb-no

DXCoolingCoil
type: Class
subclass of: Coil
comment: cooling coil using a refrigerant to cool the air stream directly.
comment: http://bsdd.buildingsmart.org/#concept/details/1exlqEQr96eATeS6qcQeE3
label: dx kjølecoil @nb-no

Electric Heating Coil
type: Class
subclass of: Coil
comment: heating coil using electricity as a heating source.
comment: http://bsdd.buildingsmart.org/#concept/details/1sKDt$czD8mQchRqMMNYlB
label: varmecoil @nb-no

Gas Heating Coil
type: Class
subclass of: Coil
comment: heating coil using gas as a heating source.
comment: http://bsdd.buildingsmart.org/#concept/details/2Y2dXDycvEJe30WIRF8tsM
label: gassfyring coil @nb-no

Hydronic Coil
type: Class
subclass of: Coil
comment: cooling or Heating coil that uses a hydronic fluid as a cooling or heating source.
comment: http://bsdd.buildingsmart.org/#concept/details/0KqvZFKzH5SQiVr$vKoSfk
label: vann/luft spole @nb-no

Steam Heating Coil
type: Class
subclass of: Coil
comment: heating coil using steam as heating source.
comment: http://bsdd.buildingsmart.org/#concept/details/2rXlQ3zHz1IwGGCAc5t50T

Water Cooling Coil
type: Class
subclass of: Coil
comment: cooling coil using chilled water. HYDRONICCOIL supercedes this enumerator.
comment: http://bsdd.buildingsmart.org/#concept/details/3AbyMrisP4ehArYy89RfYX
label: vannkjøler - coil @nb-no

Water Heating Coil
type: Class
subclass of: Coil
comment: heating coil using hot water as a heating source. HYDRONICCOIL supercedes this enumerator.
comment: http://bsdd.buildingsmart.org/#concept/details/0ZF$5RRJPDkPP$6rdC$LOy
label: vannvarme - coil @nb-no

Communications Appliance
type: Class
subclass of: Flow Terminal
comment: A communications device transmits and receives electronic or digital information as data or sound.
comment: http://bsdd.buildingsmart.org/#concept/details/3dS_KvJn16dgqG0Y8M0_8M
label: Appareil de communications @fr-fr
label: Kommunikationsgerät @de-de
label: kommunikasjonsapparat @nb-no

Antenna
type: Class
subclass of: Communications Appliance
comment: a transducer designed to transmit or receive electromagnetic waves.
comment: http://bsdd.buildingsmart.org/#concept/details/0C2VVYeDP29xB3DZDSeUl0
label: antenne @nb-no

Computer
type: Class
subclass of: Communications Appliance
comment: an electronic device which is capable of receiving information (data) in a particular form and of performing a sequence of operations in accordance with a predetermined but variable set of procedural instructions (program) to produce a result in the form of information or signals
comment: http://bsdd.buildingsmart.org/#concept/details/3YJ0SHSxL2Se6$_7rNWY_P
label: computer @nb-no
label: datagolv @nb-no
label: datagulv @nb-no
label: datamaskin @nb-no
label: gulvsystem datagulv @nb-no

Fax
type: Class
subclass of: Communications Appliance
comment: a machine for transmitting and receiving faxes
comment: http://bsdd.buildingsmart.org/#concept/details/0rZr4shW90zOb$tqxFAwq_
label: fax @nb-no

Gateway
type: Class
subclass of: Communications Appliance
comment: a gateway connects multiple network segments with different protocols at all layers (layers 1-7) of the Open Systems Interconnection (OSI) model.
comment: http://bsdd.buildingsmart.org/#concept/details/32NV4lWbbC8fXXlHfMs1EJ
label: gateway @nb-no
label: nettgrense - gateway @nb-no

Modem
type: Class
subclass of: Communications Appliance
comment: a combined device for modulation and demodulation, for example, between the digital data of a computer and the analogue signal of a telephone line
comment: http://bsdd.buildingsmart.org/#concept/details/0KFUxRBVf7AAcbfoB6t3UZ
label: modem @nb-no

Network Appliance
type: Class
subclass of: Communications Appliance
comment: http://bsdd.buildingsmart.org/#concept/details/2WnZ6tZHfC7gNz8mylrfCG

Network Bridge
type: Class
subclass of: Communications Appliance
comment: http://bsdd.buildingsmart.org/#concept/details/2BwyUI_XTBHhVWLVNXjmP1

Network Hub
type: Class
subclass of: Communications Appliance
comment: http://bsdd.buildingsmart.org/#concept/details/2isi2CWT5C8hpM6didtFuS

Printer
type: Class
subclass of: Communications Appliance
comment: a machine for printing text or pictures, especially one linked to a computer
comment: http://bsdd.buildingsmart.org/#concept/details/2gEEth5ArE5hgXWDZ2HEeu
label: printer @nb-no

Repeater
type: Class
subclass of: Communications Appliance
comment: a device for the automatic retransmission or amplification of an electrically transmitted message
comment: http://bsdd.buildingsmart.org/#concept/details/0kMGElI9XD5x0JqYWcVH5G
label: repeater @nb-no

Router
type: Class
subclass of: Communications Appliance
comment: A router is a networking device whose software and hardware are usually tailored to the tasks of routing and forwarding information. For example, on the Internet, information is directed to various paths by routers.
comment: http://bsdd.buildingsmart.org/#concept/details/3iPUFOOkn9CR_oYn1_vIJe
label: nettverksruter @nb-no

Scanner
type: Class
subclass of: Communications Appliance
comment: a device that scans documents and converts them into digital data
comment: http://bsdd.buildingsmart.org/#concept/details/3Zb4cC11TBmAB3gBWRepr4
label: scanner @nb-no

Compressor
type: Class
subclass of: Flow Moving Device
comment: A device that compresses a fluid typically used in a refrigeration circuit.
comment: http://bsdd.buildingsmart.org/#concept/details/1Qp4AN19X6Huz0qWsWQk2Q
label: Compresseur @fr-fr
label: Kompressor @de-de

Booster
type: Class
subclass of: Compressor
comment: http://bsdd.buildingsmart.org/#concept/details/0KvKrF8Vv38QKJC3iDOsZR
comment: positive-displacement reciprocating compressor where pressure is increased by a booster.
label: forsterker @nb-no

Dynamic Compressor
type: Class
subclass of: Compressor
comment: http://bsdd.buildingsmart.org/#concept/details/0bjNJRb7f3bOrNnlEVDx$V
comment: the pressure of refrigerant vapor is increased by a continuous transfer of angular momentum from a rotating member to the vapor followed by conversion of this momentum into static pressure.
label: dynamisk @nb-no

Hermetic Compressor
type: Class
subclass of: Compressor
comment: http://bsdd.buildingsmart.org/#concept/details/1QxsNyRLjDEfER9sd9a4nA
comment: positive-displacement reciprocating compressor where the motor and compressor are contained within the same housing, with the motor shaft integral with the compressor crankshaft and the motor in contact with refrigerant.
label: lukket @nb-no

Open Type Compressor
type: Class
subclass of: Compressor
comment: http://bsdd.buildingsmart.org/#concept/details/35$2VQ6Vf3yAbaBgoiZ_Qy
comment: positive-displacement reciprocating compressor where the shaft extends through a seal in the crankcase for an external drive.
label: kompressor - åpen @nb-no

Reciprocating Compressor
type: Class
subclass of: Compressor
comment: http://bsdd.buildingsmart.org/#concept/details/1rD1BDTTnA4Opl9hEUzc3J
comment: positive-displacement compressor using a piston driven by a connecting rod from a crankshaft.
label: stempel @nb-no

Rolling Piston Compressor
type: Class
subclass of: Compressor
comment: http://bsdd.buildingsmart.org/#concept/details/25ip$MycH3CApiL8P1Zfua
comment: positive-displacement rotary compressor using a roller mounted on the eccentric of a shaft with a single vane in the nonrotating cylindrical housing.
label: rullestempel @nb-no

Rotary Compressor
type: Class
subclass of: Compressor
comment: http://bsdd.buildingsmart.org/#concept/details/34DscBiG12O81W_KaUsgZs
comment: positive-displacement compressor using a roller or rotor device.
label: kompressor - roterende @nb-no

Rotary Vane Compressor
type: Class
subclass of: Compressor
comment: http://bsdd.buildingsmart.org/#concept/details/3Fnn56$If0Ywd7AMXubW5r
comment: positive-displacement rotary compressor using a roller mounted on the eccentric of a shaft with multiple vanes in the nontotating cylindrical housing.
label: kompressor - roterende vinge @nb-no

Scroll Compressor
type: Class
subclass of: Compressor
comment: http://bsdd.buildingsmart.org/#concept/details/1e5CFyUGv9suZ9ky8c_4Ir
comment: positive-displacement compressor using two inter-fitting, spiral-shaped scroll members.
label: spiral @nb-no

Semi Hermetic Compressor
type: Class
subclass of: Compressor
comment: http://bsdd.buildingsmart.org/#concept/details/0rQK7zwf97_vwAvPlWuuME
comment: positive-displacement reciprocating compressor where the hermetic compressors use bolted construction amenable to field repair.
label: semilukket @nb-no

Single Screw Compressor
type: Class
subclass of: Compressor
comment: http://bsdd.buildingsmart.org/#concept/details/2U43NgKlnBqPnnBLsl6wU4
comment: positive-displacement rotary compressor using a single cylindrical main rotor that works with a pair of gate rotors.
label: enkeltskrue @nb-no

Single Stage Compressor
type: Class
subclass of: Compressor
comment: http://bsdd.buildingsmart.org/#concept/details/1sA1FIWkz8SRjvM$gcNai0
comment: positive-displacement reciprocating compressor where vapor is compressed in a single stage.
label: ettrinns @nb-no

Trochoidal Compressor
type: Class
subclass of: Compressor
comment: http://bsdd.buildingsmart.org/#concept/details/1L2jXYOSr0k980kt8JnyQv
comment: positive-displacement compressor using a rolling motion of one circle outside or inside the circumference of a basic circle and produce either epitrochoids or hypotrochoids.
label: trokoid @nb-no

Twin Screw Compressor
type: Class
subclass of: Compressor
comment: http://bsdd.buildingsmart.org/#concept/details/3hihvfHSj9h8cGQM0xtKAu
comment: positive-displacement rotary compressor using two mating helically grooved rotors, male (lobes) and female (flutes) in a stationary housing with inlet and outlet gas ports.
label: dobbelkompressor @nb-no

Welded Shell Hermetic Compressor
type: Class
subclass of: Compressor
comment: http://bsdd.buildingsmart.org/#concept/details/3YKCxQG3X2xhA2b8$YRmuH

Condenser
type: Class
subclass of: Energy Conversion Device
comment: A device that is used to dissipate heat, typically by condensing a substance such as a refrigerant from its gaseous to its liquid state.
comment: heat exchanger that condenses refrigerant vapour by rejecting heat
comment: http://bsdd.buildingsmart.org/#concept/details/2DpcsXxln2WvYyPFOAkV$n
label: Condenseur @fr-fr
label: Kondensator @de-de
label: condensatore @it-it
label: kondensator @nb-no

Air Cooled
type: Class
subclass of: Condenser
comment: a condenser in which heat is transferred to an air-stream
comment: http://bsdd.buildingsmart.org/#concept/details/3I1OxJC71BJOJi3xkrXKKM
label: kondensator luftkjølt @nb-no

Evaporative Cooled
type: Class
subclass of: Condenser
comment: a condenser that is cooled evaporatively.
comment: http://bsdd.buildingsmart.org/#concept/details/1FUPWLndXE$hUQLc0y3Wj6
label: fordampningkjølt @nb-no

Water Cooled
type: Class
subclass of: Condenser
comment: http://bsdd.buildingsmart.org/#concept/details/1$_Cv8DcnEIhdevMYpgzOs
comment: water-cooled condenser with unspecified operation

Water Cooled Brazed Plate
type: Class
subclass of: Condenser
comment: http://bsdd.buildingsmart.org/#concept/details/3DsQKabLb8PuG7s1BwpA5x
comment: water-cooled condenser condenser with plates brazed together to form an assembly of separate channels.

Water Cooled Shell Coil
type: Class
subclass of: Condenser
comment: http://bsdd.buildingsmart.org/#concept/details/2y2FRrDI58wPQ$P0QmPB4S
comment: water-cooled condenser with cooling water circulated through one or more continuous or assembled coils contained within the shell.

Water Cooled Shell Tube
type: Class
subclass of: Condenser
comment: http://bsdd.buildingsmart.org/#concept/details/1v95Mqhl19xxpoA6ogzO73

Water Cooled Tube In Tube
type: Class
subclass of: Condenser
comment: http://bsdd.buildingsmart.org/#concept/details/2qm75n0SHCbPRb1y1l8QGa
comment: water-cooled condenser consisting of one or more assemblies of two tubes, one within the other.
label: vannkjøler - rør i rør @nb-no

Controller
type: Class
subclass of: Distribution Control Element
comment: A device that monitors inputs and controls outputs within a building automation system.
comment: http://bsdd.buildingsmart.org/#concept/details/1yoko0qSqHuO00025QrE$V
label: Organe de contrôle @fr-fr
label: Regler @de-de

Floating
type: Class
subclass of: Controller
comment: http://bsdd.buildingsmart.org/#concept/details/3v66KyDUH03vDK75zE5Ddn
comment: output increases or decreases at a constant or accelerating rate.
label: flottør @nb-no

Multi-Position
type: Class
subclass of: Controller
comment: http://bsdd.buildingsmart.org/#concept/details/2a0hNKxwTAH8HS3TExjKQd
comment: output is discrete value, can be one of three or more values.
label: flerposisjonskontroller @nb-no

Programmable
type: Class
subclass of: Controller
comment: http://bsdd.buildingsmart.org/#concept/details/1UXoUiKJr2XedXgGzf6I3D
comment: programmable logic controller containing interconnected operations and variables.
label: programerbar kontroller @nb-no

Proportional
type: Class
subclass of: Controller
comment: http://bsdd.buildingsmart.org/#concept/details/3soSUmco55dRLnyEdLB2Pe
comment: output is proportional to the control error and optionally time integral and derivative.
label: proporsjonal @nb-no

Two-Position
type: Class
subclass of: Controller
comment: http://bsdd.buildingsmart.org/#concept/details/3eIN8kftz36v5YeB_hMmzI

Chilled Beam
type: Class
subclass of: Energy Conversion Device
comment: A device typically used to cool air by circulating a fluid such as chilled water through exposed finned tubes above a space. Typically mounted overhead near or within a ceiling.
comment: http://bsdd.buildingsmart.org/#concept/details/1R134kf$f3g9C$U9ACWL3s
label: Cooled Beam
label: Kühlbalken @de-de
label: Poutre froide @fr-fr
label: Poutre froide type @fr-fr
label: kjølekonvektor @nb-no

Active
type: Class
subclass of: Chilled Beam
comment: an active or ventilated cooled beam provides cooling (and heating) but can also function as an air terminal in a ventilation system
comment: http://bsdd.buildingsmart.org/#concept/details/366WDqf6H92RxKizKbtgeZ
label: kjølekonvektor - aktiv @nb-no

Passive
type: Class
subclass of: Chilled Beam
comment: http://bsdd.buildingsmart.org/#concept/details/2xz0NcLlr5_O7fEPShW1WV
label: passiv @nb-no

Cooling Tower
type: Class
subclass of: Energy Conversion Device
comment: A device which rejects heat to ambient air by circulating a fluid such as water through it to reduce its temperature by partial evaporation.
comment: http://bsdd.buildingsmart.org/#concept/details/0ExTiEVwf5eBdOlVt_Lyd0
label: Kühlturm @de-de
label: Tour de refroidissement @fr-fr
label: kjøletårn @nb-no

Mechanical Forced Draft
type: Class
subclass of: Cooling Tower
comment: air flow is produced by a mechanical device, typically one or more fans, located on the inlet air side of the cooling tower.
comment: http://bsdd.buildingsmart.org/#concept/details/3dU1hLD$n4bwQx_$PVTTC6
label: mekanisk utkast @nb-no

Mechanical Induced Draft
type: Class
subclass of: Cooling Tower
comment: air flow is produced by a mechanical device, typically one or more fans, located on the air outlet side of the cooling tower.
comment: http://bsdd.buildingsmart.org/#concept/details/2aEmlXSRL6hO5XcfF8JxRk
label: mekanisk indusert utkast @nb-no

Natural Draft
type: Class
subclass of: Cooling Tower
comment: air flow is produced naturally.
comment: http://bsdd.buildingsmart.org/#concept/details/3O4_SVPPzB3881fdAXOU7s
label: naturlig trekk @nb-no

Damper
type: Class
subclass of: Flow Controller
comment: A flow controller in an HVAC duct distribution system and is used to control or modulate the flow of air.
comment: http://bsdd.buildingsmart.org/#concept/details/2lAXa0qT0HuO00025QrE$V
comment: innretning som brukes til å redusere støt eller vibrasjoner med energiabsorberende metoder @nb-no
label: Détecteur d'incendie @fr-fr
label: Regelklappe @de-de
label: Spjæld @da
label: serranda @it-it
label: spjeld @nb-no

Back Draft Damper
type: Class
subclass of: Damper
comment: http://bsdd.buildingsmart.org/#concept/details/0g_pG9hAD1XgJ8pML2mm5H
label: baktrekk demper @nb-no

Balancing Damper
type: Class
subclass of: Damper
comment: http://bsdd.buildingsmart.org/#concept/details/2p0wEtbSj4gxlyI6mhADq2
label: utjevningsspjeld @nb-no

Blast Damper
type: Class
subclass of: Damper
comment: http://bsdd.buildingsmart.org/#concept/details/369EqwVYL9pfnNqcXnoDHU
label: eksplosjon spjeld @nb-no

Control Damper
type: Class
subclass of: Damper
comment: http://bsdd.buildingsmart.org/#concept/details/2rVf7QFRTEWOLI2fZJuW7H

Fire Damper
type: Class
subclass of: Damper
comment: http://bsdd.buildingsmart.org/#concept/details/3mqiUJIz57JBFFnuqvB3qT

Fire Smoke Damper
type: Class
subclass of: Damper
comment: http://bsdd.buildingsmart.org/#concept/details/3fTPn78FL2kPB6iokOAbpY

Fume Hood Exhaust
type: Class
subclass of: Damper
comment: http://bsdd.buildingsmart.org/#concept/details/1U6ESQrqDFCPr0rdPKWCka
label: røykhette @nb-no

Gravity Damper
type: Class
subclass of: Damper
comment: http://bsdd.buildingsmart.org/#concept/details/1A$dgK16XE_x2gK7uacSn3

Gravity Relief Damper
type: Class
subclass of: Damper
comment: http://bsdd.buildingsmart.org/#concept/details/26urqKngv5ve948m7Tso_5

Relief Damper
type: Class
subclass of: Damper
comment: http://bsdd.buildingsmart.org/#concept/details/0CQxb8jqP12etStsVhj0a2
label: relieff spjeld @nb-no

Smoke Damper
type: Class
subclass of: Damper
comment: http://bsdd.buildingsmart.org/#concept/details/1vKdAZIn1BaBKbLSz3Ygwn
label: røyspjeld @nb-no

Distribution Chamber Element
type: Class
subclass of: Distribution Flow Element
comment: A place at which distribution systems and their constituent elements may be inspected or through which they may travel.
comment: http://bsdd.buildingsmart.org/#concept/details/1D7kC0qTCHuO00025QrE$V
label: Elément de chambre de distribution @fr-fr
label: Schacht / Graben / Revisionsschacht @de-de
label: distribusjonskammer element @nb-no

Formed Duct
type: Class
subclass of: Distribution Chamber Element
comment: http://bsdd.buildingsmart.org/#concept/details/02IcnFZFL5vOjShoJLi_XK

Inspection Chamber
type: Class
subclass of: Distribution Chamber Element
comment: chamber constructed on a drain, sewer or pipeline with a removable cover that permits visble inspection
comment: http://bsdd.buildingsmart.org/#concept/details/0XN2ZdAhP8tPdjsk4V3170
label: inspeksjonskammer @nb-no

Inspection Pit
type: Class
subclass of: Distribution Chamber Element
comment: http://bsdd.buildingsmart.org/#concept/details/05cbWWHhL7kgrWsi2U6_yV
comment: recess or chamber formed to permit access for inspection of substructure and services
label: inspeksjonsbrønn @nb-no

Manhole
type: Class
subclass of: Distribution Chamber Element
comment: http://bsdd.buildingsmart.org/#concept/details/1bbvZoH6X72QXL2iztFvrY
label: kum @nb-no

Meter Chamber
type: Class
subclass of: Distribution Chamber Element
comment: chamber that houses a meter(s)
comment: http://bsdd.buildingsmart.org/#concept/details/2t4ttlLaz5zerB1pgSekJt
label: målekammer @nb-no

Sump
type: Class
subclass of: Distribution Chamber Element
comment: http://bsdd.buildingsmart.org/#concept/details/013MAut7T66e3F7FQ6GSpz
label: drenering @nb-no

Trench
type: Class
subclass of: Distribution Chamber Element
comment: http://bsdd.buildingsmart.org/#concept/details/2yGBCxZDXDlBMJTgQNqhCM
label: grøft @nb-no

Valve Chamber
type: Class
subclass of: Distribution Chamber Element
comment: http://bsdd.buildingsmart.org/#concept/details/1JHK2axxvBXQ7W3Ey18QZW

Distribution Control Element
type: Class
subclass of: Distribution Element
comment: http://bsdd.buildingsmart.org/#concept/details/3U4sRnv$D80uOqEQZrMx_Z
comment: the distribution element ifcdistributioncontrolelement defines occurrence elements of a building automation control system that are used to impart control over elements of a distribution system. ifcdistributioncontrolelement defines elements of a building automation control system. these are typically used to control distribution system elements to maintain variables such as temperature, humidity, pressure, flow, power or lighting levels, through the modulation, staging or sequencing of mechanical or electrical devices. the three general functional categories of control elements are as follows: impart control over flow control elements (ifcflowcontroller) in a distribution system such as dampers, valves or relays, typically through the use of actuation (ifcactuator)., sensing elements (ifcsensor) that measure changes in the controlled variable such as temperature, humidity, pressure or flow., controllers (ifccontroller) typically classified according to the control action they seek to perform and generally responsible for making decisions about the elements under control.. since ifcdistributioncontrolelement and its subtypes typically relate to many different distribution flow elements (ifcdistributionflowelement), the objectified relationship ifcrelflowcontrolelements has been provided to relate control and flow elements as required. the key distinction between ifcdistributionflowelement and ifcdistributioncontrolelement is whether it is internal or external to the flow system, respectively. for example, the distinction between ifcflowmeter (subtype of ifcdistributionflowelement measuring a flow quantity) and ifcflowinstrument (subtype of ifcdistributioncontrolelement measuring a flow quality), is based on this principal. a physical device that connects within the flow system in which it measures (having inlet/outlet pipes for the measured substance) follows the ifcdistributionflowelement hierarchy (and therefore ifcflowmeter which measures the flow internally). ot…
label: Komponente der Gebäudeautomation (allgemein) @de-de
label: distribusjon manøvreringsorgan @nb-no
label: Élément de circuit de distribution @fr-fr

Distribution Element
type: Class
subclass of: SomeItems
subclass of: Product
comment: A generalization of all elements that participate in a distribution system.
comment: A generalization of all elements that participate in a distribution system. Typical examples : building service elements within a heating systems, cooling system, ventilation system, plumbing system or electrical elements within a communication network @ifc-2x4
comment: http://bsdd.buildingsmart.org/#concept/details/1UHiGqJXTCL9Ds53EKce2Y
label: Elément de distribution @fr-fr
label: haustechnische Komponente (allgemein) @de-de

Distribution Flow Element
type: Class
subclass of: Distribution Element
comment: A distribution element defined by occurrence elements of a distribution system that facilitate the distribution of energy or matter, such as air, water or power. Examples are ducts, pipes, wires, fittings, and equipment.
comment: http://bsdd.buildingsmart.org/#concept/details/2Ci$80qWWHuO00025QrE$V
label: Elément de distribution de fluide @fr-fr
label: Komponente der TGA (allgemein) @de-de
label: distribusjonsrørelement @nb-no

Duct Fitting
type: Class
subclass of: Flow Fitting
comment: A junction or transition in a ducted flow distribution system or used to connect duct segments, resulting in changes in flow characteristics to the fluid such as direction and flow rate.
comment: http://bsdd.buildingsmart.org/#concept/details/3UarA0qTqHuO00025QrE$V
label: Kanaalverbindingshulpstuk @nl-nl
label: Kanalverbinder @de-de
label: Raccord de gaine @fr-fr
label: kanalfeste @nb-no

Bend
type: Class
subclass of: Duct Fitting
comment: a fitting with typically two ports used to change the direction of flow between connected elements
comment: http://bsdd.buildingsmart.org/#concept/details/0TRO3rI8H6H9tkJsr0U5Zs
label: bend @nb-no

Connector
type: Class
subclass of: Duct Fitting
comment: http://bsdd.buildingsmart.org/#concept/details/2uxftRh$fAkhgUKLmF1KRz
label: connecteur @fr-fr
label: forbindelse @nb-no

Entry
type: Class
subclass of: Duct Fitting
comment: entry fitting, typically unconnected at one port and connected to a flow distribution system at the other (e.g., an outside air duct system intake opening)
comment: http://bsdd.buildingsmart.org/#concept/details/05vd0J9Jv4yf_lzDUNR9nD
label: inngang @nb-no

Exit
type: Class
subclass of: Duct Fitting
comment: http://bsdd.buildingsmart.org/#concept/details/0VmlPFMi57uO7GMaLeI9HP
label: utgang @nb-no

Junction
type: Class
subclass of: Duct Fitting
comment: a fitting with typically more than two ports used to redistribute flow among the ports and/or to change the direction of flow between connected elements (e.g, tee, cross, wye, etc.)
comment: a fitting with typically more than two ports used to redistribute flow among the ports and/or to change the direction of flow between connected elements (e.g, tee, cross, wye, etc.).
comment: http://bsdd.buildingsmart.org/#concept/details/0UePnHIHn9vvttWhkbxrCv
label: grenrør @nb-no
label: kryss @nb-no

Obstruction
type: Class
subclass of: Duct Fitting
comment: http://bsdd.buildingsmart.org/#concept/details/0_eTgdHQn7MwoGtRPOoi4r
label: hindring @nb-no

Transition
type: Class
subclass of: Duct Fitting
comment: http://bsdd.buildingsmart.org/#concept/details/1JknxHMCfDq9zypxDIsX5P
label: overgang @nb-no

Duct Segment
type: Class
subclass of: Flow Segment
comment: Used to typically join two sections of duct network.
comment: http://bsdd.buildingsmart.org/#concept/details/0i3x_0qTuHuO00025QrE$V
label: Kanal @de-de
label: Tronçon de gaine @fr-fr
label: kanalsegment @nb-no

Flexible Duct Segment
type: Class
subclass of: Duct Segment
comment: http://bsdd.buildingsmart.org/#concept/details/2nqUfs2mn9YQ_jGNKRyiPP
label: fleksibel delflate @nb-no
label: fleksibel rørdel @nb-no

Rigid Duct Segment
type: Class
subclass of: Duct Segment
comment: a rigid segment is a continuous linear segment of duct that cannot be deformed
comment: http://bsdd.buildingsmart.org/#concept/details/0Wy45YhJ1Bee5B_Ev4IySE
label: stiv delflate @nb-no

Duct Silencer
type: Class
subclass of: Flow Treatment Device
comment: A device that is typically installed inside a duct distribution system for the purpose of reducing the noise levels from air movement, fan noise, etc. in the adjacent space or downstream of the duct silencer device.
comment: http://bsdd.buildingsmart.org/#concept/details/2htluultzBmQOOYxoTJ2k5
label: Kanaalgeluiddemper @nl-nl
label: Kanalschalldämpfer @de-de
label: Silencieux circulaire @fr-fr

Flat Oval Duct Silencer
type: Class
subclass of: Duct Silencer
comment: http://bsdd.buildingsmart.org/#concept/details/0VN55_f5zDDwQXiRI$8Z_y
label: flatoval @nb-no

Rectangular Duct Silencer
type: Class
subclass of: Duct Silencer
comment: http://bsdd.buildingsmart.org/#concept/details/3NtvXddFX5JRlghR5mPion
label: rektangulær @nb-no

Round Duct Silencer
type: Class
subclass of: Duct Silencer
comment: http://bsdd.buildingsmart.org/#concept/details/0Pab9zW$v0E8Xbyt9Joo2A
label: sirkulær @nb-no

Electric Appliance
type: Class
subclass of: Flow Terminal
comment: A device intended for consumer usage that is powered by electricity. May be fixed in place or able to be moved from one space to another. Requires an electrical supply that may be supplied either by an electrical circuit or provided from a local battery source.
comment: http://bsdd.buildingsmart.org/#concept/details/3YTFM$9GvByR7HJawXiG4V
label: Appareil électrique @fr-fr
label: Elektrisches Gerät @de-de
label: elektrisk innretning @nb-no

Dishwasher
type: Class
subclass of: Electric Appliance
comment: an appliance that has the primary function of washing dishes
comment: appliance for washing dishes
comment: diskmaskin @sv-se
comment: http://bsdd.buildingsmart.org/#concept/details/02NUQ13z56XvvUbtiIY3SW
label: Geschirrspülmaschine @de-de
label: diskmaskin @sv-se
label: machine à laver la vaisselle @fr-fr
label: oppvaskmaskin @nb-no

Electric Cooker
type: Class
subclass of: Electric Appliance
comment: an electrical appliance that has the primary function of cooking food (including oven, hob, grill)
comment: http://bsdd.buildingsmart.org/#concept/details/1fQUOe4mvC$PVZhL6$zYMj
label: kokeplate @nb-no

Free Standing Electric Heater
type: Class
subclass of: Electric Appliance
comment: http://bsdd.buildingsmart.org/#concept/details/2vmsBMt5f6vOIJtsLV43C5

Free Standing Fan
type: Class
subclass of: Electric Appliance
comment: http://bsdd.buildingsmart.org/#concept/details/1sbx$V$pfE3gA1HPGomlqC

Free Standing Water Cooler
type: Class
subclass of: Electric Appliance
comment: http://bsdd.buildingsmart.org/#concept/details/2GNk4XczH2a9Bo486M2Dhf

Free Standing Water Heater
type: Class
subclass of: Electric Appliance
comment: a small, local electrical appliance for heating water. a freestanding water heater is a 'plugged' appliance whose load may be removed from an electric circuit
comment: http://bsdd.buildingsmart.org/#concept/details/0hmcm_zGD2HuO7SHEfEIAX
label: varmtvannsbereder @nb-no

Freezer
type: Class
subclass of: Electric Appliance
comment: an electrical appliance that has the primary function of storing food at temperatures below the freezing point of water
comment: http://bsdd.buildingsmart.org/#concept/details/2lufsAWJmHu000025QrE$V
label: Vrieskast @nl-nl
label: fryser @nb-no

Fridge Freezer
type: Class
subclass of: Electric Appliance
comment: http://bsdd.buildingsmart.org/#concept/details/2$l6h0fcP1u9I_bcu2_2t0

Hand Dryer
type: Class
subclass of: Electric Appliance
comment: http://bsdd.buildingsmart.org/#concept/details/0MdGYaJi90Ugvs9F4IBH45

Kitchen Machine
type: Class
subclass of: Electric Appliance
comment: a specialized appliance used in commercial kitchens such as a mixer
comment: http://bsdd.buildingsmart.org/#concept/details/3jScF9EaLB6wWXD1wgq6DV
label: kjøkkenmaskin @nb-no

MicroWave
type: Class
subclass of: Electric Appliance
comment: an electrical appliance that has the primary function of cooking food using microwaves
comment: http://bsdd.buildingsmart.org/#concept/details/3aYGRc49PF4AXOOV4IRJxc
label: mikrobølge @nb-no

Photocopier
type: Class
subclass of: Electric Appliance
comment: a machine that has the primary function of reproduction of printed matter
comment: http://bsdd.buildingsmart.org/#concept/details/3f7QlBmRH8ixz3XB$p1vFX
label: kopimaskin @nb-no

Refrigerator
type: Class
subclass of: Electric Appliance
comment: http://bsdd.buildingsmart.org/#concept/details/2lIWS0WJmHu000025QrE$V
label: Koelkast @nl-nl
label: kjøleskap @nb-no

Dryer
type: Class
subclass of: Electric Appliance
comment: http://bsdd.buildingsmart.org/#concept/details/3vHWUCoT0Hsm00051Mm008
label: Tumble Dryer
label: Wäschetrockner @de-de
label: machine séchante @fr-fr
label: tørketrommel @nb-no

Vending Machine
type: Class
subclass of: Electric Appliance
comment: http://bsdd.buildingsmart.org/#concept/details/3a1GPgbGb4HhfJfWNNnwRG

Washing Machine
type: Class
subclass of: Electric Appliance
comment: http://bsdd.buildingsmart.org/#concept/details/3nK_JH93v5JRpo7imsOJm6

Electric Distribution Board
type: Class
subclass of: Flow Controller
comment: A flow controller in which instances of electrical devices are brought together at a single place for a particular purpose. A distribution provides a housing for connected electrical distribution elements so that they can be viewed, operated or acted upon from a single place. Each connected item may have its own geometric representation and location.
comment: http://bsdd.buildingsmart.org/#concept/details/1NTXNvjYPEHAEdF4$lUOA4
label: Elektrischer Verteilungsregler @de-de
label: Tableau de distribution électrique @fr-fr

Consumer Unit
type: Class
subclass of: Electric Distribution Board
comment: http://bsdd.buildingsmart.org/#concept/details/02vRNiXL17Ng6A0tyY3IZm

Distribution Board
type: Class
subclass of: Electric Distribution Board
comment: http://bsdd.buildingsmart.org/#concept/details/2t_kmsr_9FbOzG08gdq5sn

Motor Control Centre
type: Class
subclass of: Electric Distribution Board
comment: http://bsdd.buildingsmart.org/#concept/details/23gvwO2$16qPz5TGUDljzB

Switch Board
type: Class
subclass of: Electric Distribution Board
comment: http://bsdd.buildingsmart.org/#concept/details/3XP0I3Joj7y8AYq9ASPean

Electric Flow Storage Device
type: Class
subclass of: Flow Storage Device
comment: A device in which electrical energy is stored and from which energy may be progressively released.
comment: http://bsdd.buildingsmart.org/#concept/details/1QtwhR5Zn328NFUBlGt0yh
label: Elektrisches Speichergerät @de-de
label: strømlagringsenhet @nb-no

Battery
type: Class
subclass of: Electric Flow Storage Device
comment: a device for storing energy in chemical form so that it can be released as electrical energy
comment: http://bsdd.buildingsmart.org/#concept/details/2SgW4DbB93yuwE75nOI9iX
label: batteri @nb-no

Capacitor Bank
type: Class
subclass of: Electric Flow Storage Device
comment: a device that stores electrical energy when an external power supply is present using the electrical property of capacitance
comment: http://bsdd.buildingsmart.org/#concept/details/3T$uPXx997$B5skfKbEgBk
label: kapasitetsbank @nb-no

Harmonic Filter
type: Class
subclass of: Electric Flow Storage Device
comment: http://bsdd.buildingsmart.org/#concept/details/3CCGbA$dfCHxGIK0Zz2C08

Inductor Bank
type: Class
subclass of: Electric Flow Storage Device
comment: http://bsdd.buildingsmart.org/#concept/details/0s_ACAnfD8YAPin0isHx0d

UPS
type: Class
subclass of: Electric Flow Storage Device
comment: a device that provides a time limited alternative source of power supply in the event of failure of the main supply
comment: combination of convertors, switches and energy storage devices (for example batteries), constituting a power system for maintaining continuity of load power in case of input power failure.
comment: http://bsdd.buildingsmart.org/#concept/details/1ru5tvtfLE7g$pBOrRs6g$
label: uninterruptible power supply
label: uninterruptible power system

Electric Generator
type: Class
subclass of: Energy Conversion Device
comment: An engine that is a machine for converting mechanical energy into electrical energy.
comment: http://bsdd.buildingsmart.org/#concept/details/1xmminhSL6bhcxZRNY$u6Z
label: Elektrogenerator @de-de
label: elektrogenerator @nb-no
label: générateur électrique @fr-fr

CHP
type: Class
subclass of: Electric Generator
comment: combined heat and power supply, used not only as a source of electric energy but also as a heating source for the building. it may therefore be not only part of an electrical system but also of a heating system
comment: http://bsdd.buildingsmart.org/#concept/details/2vNA8q44vBZRsy_n0gsv2T
label: kraftvarmeverk @nb-no

Engine Generator
type: Class
subclass of: Electric Generator
comment: electrical generator with a fuel-driven engine, for example a diesel-driven emergency power supply
comment: http://bsdd.buildingsmart.org/#concept/details/1cgIU0HJT6GuV3i$OWzcqr
label: motorgenerator @nb-no

Standalone Generator
type: Class
subclass of: Electric Generator
comment: electrical generator which does not include its source of kinetic energy, that is, a motor, engine, or turbine are all modeled separately
comment: http://bsdd.buildingsmart.org/#concept/details/385E6cNGD9CAcjlAWZNrUW
label: frittstående @nb-no

Electric Motor
type: Class
subclass of: Energy Conversion Device
comment: An engine that is a machine for converting electrical energy into mechanical energy.
comment: http://bsdd.buildingsmart.org/#concept/details/3_kLW3eI10Xem4Z9zSCTzp
label: Elektromotor @de-de
label: Moteur électrique @fr-fr
label: elektrisk motor @nb-no
label: elektromotor @nl-nl

DC-motor
type: Class
subclass of: Electric Motor
comment: a motor using either generated or rectified Direct Current (DC) power
comment: http://bsdd.buildingsmart.org/#concept/details/3FK3hjao1DDw14M1qybLxa
label: DC - motor @nb-no

Induction Motor
type: Class
subclass of: Electric Motor
comment: an alternating current motor in which the primary winding on one member (usually the stator) is connected to the power source and a secondary winding or a squirrel-cage secondary winding on the other member (usually the rotor) carries the induced current. there is no physical electrical connection to the secondary winding, its current is induced
comment: http://bsdd.buildingsmart.org/#concept/details/3OYMbkndX6lxYQ5WInnHhX
label: induksjon @nb-no

Polyphase Motor
type: Class
subclass of: Electric Motor
comment: a two or three-phase induction motor in which the windings, one for each phase, are evenly divided by the same number of electrical degrees
comment: http://bsdd.buildingsmart.org/#concept/details/1US3A1hwXBIA9FaVqUl3HY
label: flerfasmotor @nb-no

Reluctance Synchronous Motor
type: Class
subclass of: Electric Motor
comment: http://bsdd.buildingsmart.org/#concept/details/2lD9V5iynEBB3XgItdjfos

Synchronous Motor
type: Class
subclass of: Electric Motor
comment: a motor that operates at a constant speed up to full load. the rotor speed is equal to the speed of the rotating magnetic field of the stator; there is no slip
comment: http://bsdd.buildingsmart.org/#concept/details/3aYFsz0Ij95vr3j85mOzlh
label: synkromotor @nb-no

Electric Time Control
type: Class
subclass of: Flow Controller
comment: A device that applies control to the provision or flow of electrical energy over time.
comment: http://bsdd.buildingsmart.org/#concept/details/34zeeiRU160PRfc1BOv2UT
label: Elektrische Zeitsteuerung @de-de
label: elektronisk tidskontroll @nb-no

Relay
type: Class
subclass of: Electric Time Control
comment: electromagnetically operated contactor for making or breaking a control circuit
comment: http://bsdd.buildingsmart.org/#concept/details/1uMPSl_pL5eufzS8GVHHU$
label: relais @fr-fr
label: relè @nb-no
label: relé @nb-no

Time Clock
type: Class
subclass of: Electric Time Control
comment: http://bsdd.buildingsmart.org/#concept/details/3_BiobHgL589mZt5gGZ6vc

Time Delay
type: Class
subclass of: Electric Time Control
comment: http://bsdd.buildingsmart.org/#concept/details/1frllCTITFVANbn$YJ11RW

Energy Conversion Device
type: Class
subclass of: Distribution Flow Element
comment: http://bsdd.buildingsmart.org/#concept/details/1VQ1GZZDD2pvhjZ8ZKtCoL
comment: the distribution flow element ifcenergyconversiondevice defines the occurrence of a device used to perform energy conversion or heat transfer and typically participates in a flow distribution system. its type is defined by ifcenergyconversiondevicetype or its subtypes.
label: Energiewandler @de-de
label: aggregat frys @nb-no
label: aggregat kjøl virksomhet @nb-no
label: aggregate freezer
label: aggregate refrigirator industry
label: dispositif de conversion d'énergie @fr-fr
label: kjøleaggregat @nb-no

Engine
type: Class
subclass of: Energy Conversion Device
comment: A device that converts fuel into mechanical energy through combustion.
comment: http://bsdd.buildingsmart.org/#concept/details/2Z1mXqriH13epQNHSH0Q6U
label: Moteur @fr-fr
label: Motor @de-de
label: motor @nb-no

External Combustion Engine
type: Class
subclass of: Engine
comment: combustion is external
comment: http://bsdd.buildingsmart.org/#concept/details/2NLKuMKf91wviDc2F5qWzU
label: utvendig forbrenning @nb-no

Internal Combustion Engine
type: Class
subclass of: Engine
comment: combustion is internal
comment: http://bsdd.buildingsmart.org/#concept/details/2Tx86TGHX9mfF61hssJ$wH
label: forbrenningsmotor @nb-no

Evaporative Cooler
type: Class
subclass of: Energy Conversion Device
comment: A device that cools air by saturating it with water vapor.
comment: http://bsdd.buildingsmart.org/#concept/details/3q9N4QJHXEvB$P7TiIBB3x
label: Refroidisseur évaporatif @fr-fr
label: Verdunstungskühler @de-de
label: fordampningskjøler @nb-no
label: verdampingskoeler @nl-nl

Direct Evaporative Air Washer
type: Class
subclass of: Evaporative Cooler
comment: http://bsdd.buildingsmart.org/#concept/details/1mfNeZzsr75wDjPDHJlb4H
label: direkte luftfukter - luftvasker @nb-no

Direct Evaporative Packaged Rotary Air Cooler
type: Class
subclass of: Evaporative Cooler
comment: http://bsdd.buildingsmart.org/#concept/details/1cj7p5WhDB_xBonDIVd_4z

Direct Evaporative Random Media Air Cooler
type: Class
subclass of: Evaporative Cooler
comment: http://bsdd.buildingsmart.org/#concept/details/0UORhKPhjCL85YKa2Bnb3r

Direct Evaporative Rigid Media Air Cooler
type: Class
subclass of: Evaporative Cooler
comment: http://bsdd.buildingsmart.org/#concept/details/0MWgqKd0z5GPNm6aaAnj5C

Direct Evaporative Slingers Packaged Air Cooler
type: Class
subclass of: Evaporative Cooler
comment: http://bsdd.buildingsmart.org/#concept/details/16b3LdCezBDPr$dY5Jspfu

Indirect Direct Combination
type: Class
subclass of: Evaporative Cooler
comment: http://bsdd.buildingsmart.org/#concept/details/0m3PNQ2HLCZxrflh7tIhW4
label: kombinasjonskjøler @nb-no

Indirect Evaporative Cooling Tower Or Coil Cooler
type: Class
subclass of: Evaporative Cooler
comment: http://bsdd.buildingsmart.org/#concept/details/2NrTpcYUv9zg$5$$fO_19L
label: indirekte damp kjøletårn @nb-no

Indirect Evaporative Package Air Cooler
type: Class
subclass of: Evaporative Cooler
comment: http://bsdd.buildingsmart.org/#concept/details/0jmwDswxz4_AQl2__GUqUv
label: indirekte dampkjøler @nb-no

Indirect Evaporative Wet Coil
type: Class
subclass of: Evaporative Cooler
comment: http://bsdd.buildingsmart.org/#concept/details/1LV$DC3_H2PQ4WPTuDrKrT
label: indirekte damp coil @nb-no

Evaporator
type: Class
subclass of: Energy Conversion Device
comment: A liquid refrigerant is vaporized and absorbs heat from the surrounding fluid.
comment: In heat transfer systems, a evaporator is a device used to turn a liquid into its gaseous form
comment: http://bsdd.buildingsmart.org/#concept/details/1b85u16kXAuQVMX36yZmUh
label: Evaporateur @fr-fr
label: kjøleelement @nb-no
label: luftfukter @nb-no
label: verdamper @nl-nl
label: verdampfer @de-de
label: évaporateur @fr-fr

Direct Expansion
type: Class
subclass of: Evaporator
comment: http://bsdd.buildingsmart.org/#concept/details/09VTDOubL8rQM9Zzgh3ZOX
label: direkte ekspansjon @nb-no

Direct Expansion Brazed Plate
type: Class
subclass of: Evaporator
comment: http://bsdd.buildingsmart.org/#concept/details/1T3UjVbrn8GRRfXuXNLYnr
label: direkte ekspansjon loddeplate @nb-no

Direct Expansion Shell And Tube
type: Class
subclass of: Evaporator
comment: http://bsdd.buildingsmart.org/#concept/details/1u9oqdehL1dgBJ6OLyn3QA
label: direkte ekspansjon rette rør @nb-no

Direct Expansion Tube In Tube
type: Class
subclass of: Evaporator
comment: http://bsdd.buildingsmart.org/#concept/details/3sib_FFsX9OPAtp2_avAxn
label: direkte ekspansjon rør-i-rør @nb-no

Flooded Shell And Tube
type: Class
subclass of: Evaporator
comment: http://bsdd.buildingsmart.org/#concept/details/0ccrsyQl54TBm8fRTQgQ74

Shell And Coil
type: Class
subclass of: Evaporator
comment: http://bsdd.buildingsmart.org/#concept/details/30V2jCzRrB$APJOlZf7jhx

Fan
type: Class
subclass of: Flow Moving Device
comment: A device which imparts mechanical work on a gas. A typical usage of a fan is to induce airflow in a building services air distribution system.
comment: A machine for the movement of air that has a rotating impeller, often for cooling.
comment: An artefact which delivers or exhausts volumes of air or gas at low differential pressure.
comment: funksjonsdel for bevegelse av luft med roterende element, ofte brukt til kjøling. @nb-no
comment: http://bsdd.buildingsmart.org/#concept/details/1ugSc0qUCHuO00025QrE$V
label: Ventilator @de-de
label: ventilateur @fr-fr
label: vifte @nb-no

Centrifugal Air Foil
type: Class
subclass of: Fan
comment: http://bsdd.buildingsmart.org/#concept/details/2b2DdpoeD2DebGtqb8$WWB

Centrifugal Backward Inclined Curved Fan
type: Class
subclass of: Fan
comment: http://bsdd.buildingsmart.org/#concept/details/2947TJClP4iRuoq1E3mkRW

Centrifugal Forward Curved Fan
type: Class
subclass of: Fan
comment: http://bsdd.buildingsmart.org/#concept/details/2BtF98qKP9pAJgsmJrKTcX

Centrifugal Radial Fan
type: Class
subclass of: Fan
comment: http://bsdd.buildingsmart.org/#concept/details/3ZTCLrBaz0NwkdZhJ1jzAB

Propellor Axial Fan
type: Class
subclass of: Fan
comment: http://bsdd.buildingsmart.org/#concept/details/0B7IEewCf7DPbZs58QORZ_

Tube Axial Fan
type: Class
subclass of: Fan
comment: air flows through the impeller axially with reduced tip clearance and operating at higher tip speeds
comment: http://bsdd.buildingsmart.org/#concept/details/0uYC2U15n0ggOtHNsP3kmN
label: tube aksialvifte @nb-no

Vane Axial Fan
type: Class
subclass of: Fan
comment: air flows through the impeller axially with guide vanes and reduced running blade tip clearance
comment: http://bsdd.buildingsmart.org/#concept/details/2W_hdCD6D3DPaj$HRNjU0Z
label: lamellaksial vifte @nb-no

Filter
type: Class
subclass of: Flow Treatment Device
comment: An apparatus used to remove particulate or gaseous matter from fluids and gases
comment: http://bsdd.buildingsmart.org/#concept/details/07moCBVkH3OhoQDperZAGA
label: filtre @fr-fr

Air Particle Filter
type: Class
subclass of: Filter
comment: http://bsdd.buildingsmart.org/#concept/details/2ha4cuVrn2CO6DtVG5m_2l
label: støvutskiller (filter) @nb-no

Compressed Air Filter
type: Class
subclass of: Filter
comment: http://bsdd.buildingsmart.org/#concept/details/3eXdymzEL2WwWgDskL3E7I

Odor Filter
type: Class
subclass of: Filter
comment: http://bsdd.buildingsmart.org/#concept/details/0Nh$mYaRT13xMPbS$8vqwW

Oil Filter
type: Class
subclass of: Filter
comment: a filter used to remove particulates from oil
comment: http://bsdd.buildingsmart.org/#concept/details/0HemsvirL2luh4LogPKmfT
label: oljefilter @nb-no

Strainer
type: Class
subclass of: Filter
comment: A fitting for preventing that leaves enters the down-pipe
comment: En innretning som hindrer løv og annet nedfall i å komme inn i nedløpsrøret @nb-no
comment: device that prevents solid matter from entering a pipe, pump, valve or meter
comment: http://bsdd.buildingsmart.org/#concept/details/30aQppcM58MR6pxe6iVccR
label: Siebe @de-de
label: filtre @fr-fr
label: løvrist @nb-no
label: sil @nb-no

Water Filter
type: Class
subclass of: Filter
comment: http://bsdd.buildingsmart.org/#concept/details/3IqBAp0Tv5HxjI8BQo7oFW
label: vannfilter @nb-no

Fire Suppression Terminal
type: Class
subclass of: Flow Terminal
comment: A suppression terminal has the purpose of delivering a fluid (gas or liquid) that will suppress a fire. Provides for all forms of sprinkler, spreader and other form of terminal that is connected to a pipework system and intended to act in the role of suppressing a fire.
comment: http://bsdd.buildingsmart.org/#concept/details/1P1aiBVvPDjPVBP4TWbJw6
label: Appareil terminal d'extinction d'incendie @fr-fr
label: Feuerlöscheinrichtung @de-de
label: brannundertrykkelsessystem @nb-no

Breeching Inlet
type: Class
subclass of: Fire Suppression Terminal
comment: http://bsdd.buildingsmart.org/#concept/details/00IdsJ7iT7Nx$veMrXzcqM

Fire Hydrant
type: Class
subclass of: Fire Suppression Terminal
comment: http://bsdd.buildingsmart.org/#concept/details/1esoBNGDb2wOo3IcBnG9Zv

Hosereel
type: Class
subclass of: Fire Suppression Terminal
comment: http://bsdd.buildingsmart.org/#concept/details/3BjPDggX5A1uWncjNaSpTp

Sprinkler
type: Class
subclass of: Fire Suppression Terminal
comment: http://bsdd.buildingsmart.org/#concept/details/09wWrp7P91aASjo0_dry01
comment: nozzle with a thermally sensitive sealing device which opens to discharge water for fire fighting
label: fire sprinkler
label: sprinkler @nb-no

Sprinkler Deflector
type: Class
subclass of: Fire Suppression Terminal
comment: http://bsdd.buildingsmart.org/#concept/details/2LU6yVzZT7U8X4VneBA$Bh

Flow Controller
type: Class
subclass of: Distribution Flow Element
comment: http://bsdd.buildingsmart.org/#concept/details/1iDky6Xqz0NhbMNjWBjWCy
comment: the distribution flow element ifcflowcontroller defines the occurrence of elements of a distribution system that are used to regulate flow through a distribution system. examples include dampers, valves, switches, and relays. its type is defined by ifcflowcontrollertype or subtypes.
label: Regler (allgemein) @de-de
label: contrôleur de débit @fr-fr
label: vannmengderegulator @nb-no

Flow Fitting
type: Class
subclass of: Distribution Flow Element
comment: Elkraftfordeling til driftstekniske installasjoner @nb-no
comment: Elkraftfordeling til virksomhet @nb-no
comment: http://bsdd.buildingsmart.org/#concept/details/0QXNqIaY58ARlIeBKvxECI
comment: the distribution flow element ifcflowfitting defines the occurrence of a junction or transition in a flow distribution system, such as an elbow or tee. its type is defined by ifcflowfittingtype or its subtypes.
label: Verbinder / Formstück (allgemein) @de-de
label: koblinger driftsteknisk @nb-no
label: koblinger virksomhet @nb-no
label: raccord d'installation fluides @fr-fr

Flow Instrument
type: Class
subclass of: Distribution Control Element
comment: An instrument reads and displays the flow value of a particular property of a system at a point, or displays the difference in the value of a property between two points. Typically for the purpose of determining the value of the property at a point in time. Includes forms of mechanical flow instrument (thermometers, pressure gauges etc.) and electrical flow instruments (ammeters, voltmeters etc.)
comment: http://bsdd.buildingsmart.org/#concept/details/11jUOktIH3ZBjsCen5K$76
label: Instrument d'installation fluides @fr-fr
label: Messinstrument (allgemein) @de-de
label: strømningsinstrument @nb-no

AMMeter
type: Class
subclass of: Flow Instrument
comment: a device that reads and displays the current flow in a circuit
comment: http://bsdd.buildingsmart.org/#concept/details/1ZnXtG18TFxghzaROUOOEo
label: amperemeter @nb-no

Frequency Meter
type: Class
subclass of: Flow Instrument
comment: a device that reads and displays the electrical frequency of an alternating current circuit.
comment: http://bsdd.buildingsmart.org/#concept/details/01E8ZEHkn6nuRHiPM5blVG
label: frekvensmåler @nb-no

Phase-Angle Meter
type: Class
subclass of: Flow Instrument
comment: a device that reads and displays the phase angle of a phase in a polyphase electrical circuit
comment: http://bsdd.buildingsmart.org/#concept/details/3Gf7_xpUn18gOIu3amQEQH
label: fasevinkelmåler @nb-no

Power Factor Meter
type: Class
subclass of: Flow Instrument
comment: http://bsdd.buildingsmart.org/#concept/details/1P$PbnF35AFwKgPqjZPzC0

Pressure Gauge
type: Class
subclass of: Flow Instrument
comment: http://bsdd.buildingsmart.org/#concept/details/0OE6$aHKjCBBgczwu$WIy0

Thermometer
type: Class
subclass of: Flow Instrument
comment: Måler og viser temperatur analogt @nb-no
comment: a device that reads and displays a temperature value at a point
comment: http://bsdd.buildingsmart.org/#concept/details/3vHXe6oT0Hsm00051Mm008
label: Temperaturmeßgerät @de-de
label: termometer @nb-no
label: thermomètre @fr-fr

Peak Volt Meter
type: Class
subclass of: Flow Instrument
comment: a device that reads and displays the peak voltage in an electrical circuit
comment: http://bsdd.buildingsmart.org/#concept/details/3HJn6Sn$TBNQmm9Dwrzknj
label: toppverdi voltmeter @nb-no

RMS Volt Meter
type: Class
subclass of: Flow Instrument
comment: a device that reads and displays the RMS (mean) voltage in an electrical circuit
comment: http://bsdd.buildingsmart.org/#concept/details/2rsw3JDZn4yRFLbTU1Aq7v
label: rms voltmeter @nb-no

Flow Meter
type: Class
subclass of: Flow Controller
comment: A device that is used to measure the flow rate in a system.
comment: http://bsdd.buildingsmart.org/#concept/details/3lICO0qUSHuO00025QrE$V
label: Appareil de mesure de débit @fr-fr
label: Zähler (allgemein) @de-de
label: flytmåler @nb-no
label: vannmengdemåler @nb-no

Energy Meter
type: Class
subclass of: Flow Meter
comment: device that measures, indicates and sometimes records, the energy usage in a system
comment: http://bsdd.buildingsmart.org/#concept/details/0dqsT4P2DFmvAItnTOiex9
label: energimåler @nb-no

Gas Meter
type: Class
subclass of: Flow Meter
comment: device that measures, indicates and sometimes records, the volume of gas that passes through it without interrupting the flow
comment: http://bsdd.buildingsmart.org/#concept/details/2d9Kt_TA9Dww_aaJ0$7nqk
label: gassmåler @nb-no

Oil Meter
type: Class
subclass of: Flow Meter
comment: http://bsdd.buildingsmart.org/#concept/details/2HD3O5A6XAmQiJv54wilAx
comment: not available
label: oljemåler @nb-no

Water Meter
type: Class
subclass of: Flow Meter
comment: http://bsdd.buildingsmart.org/#concept/details/2bpgnuN4XCdOPs0pKS1wP1

Flow Moving Device
type: Class
subclass of: Distribution Flow Element
comment: http://bsdd.buildingsmart.org/#concept/details/1z188Qjir3JArIaN1C$Jlp
comment: the distribution flow element ifcflowmovingdevice defines the occurrence of an apparatus used to distribute, circulate or perform conveyance of fluids, including liquids and gases (such as a pump or fan), and typically participates in a flow distribution system. its type is defined by ifcflowmovingdevicetype or its subtypes.
label: Strömungsmaschine (allgemein) @de-de
label: dispositif de circulation de fluide @fr-fr
label: flow moving device type
label: strømførende enhet @nb-no

Flow Segment
type: Class
subclass of: Distribution Flow Element
comment: http://bsdd.buildingsmart.org/#concept/details/3pgLxEkmTCmg6JWI8OZE4J
comment: the distribution flow element ifcflowsegment defines the occurrence of a segment of a flow distribution system. the ifcflowsegment defines a particular occurrence of a segment inserted in the spatial context of a project. the parameters defining the type of the segment and/or its shape are defined by the ifcflowsegmenttype, which is related by the inverse relationship isdefinedby pointing to ifcreldefinesbytype.
label: Verteiler (allgemein) @de-de
label: strømførende segment @nb-no
label: tronçon d'installation fluides @fr-fr

Flow Storage Device
type: Class
subclass of: Distribution Flow Element
comment: http://bsdd.buildingsmart.org/#concept/details/32pa_OQBP6exzNXNT$7YTr
comment: the distribution flow element ifcflowstoragedevice defines the occurrence of a device that participates in a distribution system and is used for temporary storage (such as a tank). its type is defined by ifcflowstoragedevicetype or its subtypes.
label: Speicher (allgemein) @de-de
label: appareil de stockage de fluide @fr-fr
label: strømlagrende enhet @nb-no

Flow Terminal
type: Class
subclass of: Distribution Flow Element
comment: http://bsdd.buildingsmart.org/#concept/details/2zsZIJsQfBq98RWGNFmix9
comment: the distribution flow element ifcflowterminal defines the occurrence of a permanently attached element that acts as a terminus or beginning of a distribution system (such as an air outlet, drain, water closet or sink). a terminal is typically a point at which a system interfaces with an external environment. its type is defined by ifcflowterminaltype or its subtypes.
label: Endgerät (allgemein) @de-de
label: elément terminal d'installation fluides @fr-fr
label: strømterminal @nb-no

Flow Treatment Device
type: Class
subclass of: Distribution Flow Element
comment: http://bsdd.buildingsmart.org/#concept/details/358GrBQjP36vPq9aYtgYQa
comment: the distribution flow element ifcflowtreatmentdevice defines the occurrence of a device typically used to remove unwanted matter from a fluid, either liquid or gas, and typically participates in a flow distribution system. its type is defined by ifcflowtreatmentdevicetype or its subtypes.
label: Filter @de-de
label: appareil de traitement de fluide @fr-fr
label: strømbehandlingsenhet @nb-no

Heat Exchanger
type: Class
subclass of: Energy Conversion Device
comment: A device used to provide heat transfer between non-mixing media such as plate and shell and tube heat exchangers. Commonly used on water-side distribution systems to recover energy from a liquid to another liquid (typically water-based).
comment: An artefact intended for transferring thermal energy from one fluid to another.
comment: http://bsdd.buildingsmart.org/#concept/details/3WpPiXIp5Bf89w8w0QL9_r
label: Echangeur de chaleur @fr-fr
label: Varmeveksler @da
label: Warmtewisselaar @nl
label: Wärmetauscher @de-de
label: varmeveksler @nb-no

Plate Heat Exchanger
type: Class
subclass of: Heat Exchanger
comment: http://bsdd.buildingsmart.org/#concept/details/2pALi8Jfv7Se_pR4H3dTaH
label: platevarmeveksler @nb-no

Shell And Tube Heat Exchanger
type: Class
subclass of: Heat Exchanger
comment: http://bsdd.buildingsmart.org/#concept/details/1h3yHT$MPE0BoJuFFtf4$5
label: varmeveksler med rette rør @nb-no

Humidifier
type: Class
subclass of: Energy Conversion Device
comment: A device that adds moisture into the air.
comment: http://bsdd.buildingsmart.org/#concept/details/1FcXNG5qj2GQITbOwXrOIF
label: Befeuchter @de-de
label: Befugter @da
label: humidificateur @fr-fr
label: luftfukter @nb-no

Adiabatic Air Washer
type: Class
subclass of: Humidifier
comment: http://bsdd.buildingsmart.org/#concept/details/2MNV0vgOv328qlczPJ03OC
label: adiabatisk luftvasker @nb-no

Adiabatic Atomizing
type: Class
subclass of: Humidifier
comment: http://bsdd.buildingsmart.org/#concept/details/1K4HZEHEv1wQ19Vzk48Sgn
comment: water vapor is added into the airstream through adiabatic evaporation using an atomizing element
label: adiabatisk forstøver @nb-no

Adiabatic Compressed Air Nozzle
type: Class
subclass of: Humidifier
comment: http://bsdd.buildingsmart.org/#concept/details/2HCfOW4In2BREPSqe5Ms$p
comment: water vapor is added into the airstream through adiabatic evaporation using a compressed air nozzle
label: adiabatisk trykkluftdyse @nb-no

Adiabatic Pan
type: Class
subclass of: Humidifier
comment: http://bsdd.buildingsmart.org/#concept/details/3d9dTNKyPFRRor9abHmtji
label: adiabatisk kar @nb-no

Adiabatic Rigid Media
type: Class
subclass of: Humidifier
comment: http://bsdd.buildingsmart.org/#concept/details/0RD4N$yNr7jQPEzfNuNDtm
comment: water vapor is added into the airstream through adiabatic evaporation using a rigid media
label: adiabatisk rigid medium @nb-no

Adiabatic Ultra Sonic
type: Class
subclass of: Humidifier
comment: http://bsdd.buildingsmart.org/#concept/details/0LHdcNpKzA9fe_4pzr59WD
comment: water vapor is added into the airstream through adiabatic evaporation using an ultrasonic element
label: adiabatisk ultralyd @nb-no

Adiabatic Wetted Element
type: Class
subclass of: Humidifier
comment: http://bsdd.buildingsmart.org/#concept/details/3K$6EMdYfCzPmmFTgegHDy
label: adiabatisk våtelement @nb-no

Assisted Butane
type: Class
subclass of: Humidifier
comment: http://bsdd.buildingsmart.org/#concept/details/2VKdEEkCn1ghIvaWPax9j3
comment: water vapor is added into the airstream through water heated evaporation using a butane heater
label: assistert butan @nb-no

Assisted Electric
type: Class
subclass of: Humidifier
comment: http://bsdd.buildingsmart.org/#concept/details/157UtcquX8d8khI$Nxg6Dg
comment: water vapor is added into the airstream through water heated evaporation using an electric heater
label: assistert elektrisitet @nb-no

Assisted Natural Gas
type: Class
subclass of: Humidifier
comment: http://bsdd.buildingsmart.org/#concept/details/2y1ecVVOv7Lfs9vbXts2uj
label: assistert naturgass @nb-no

Assisted Propane
type: Class
subclass of: Humidifier
comment: http://bsdd.buildingsmart.org/#concept/details/1Byt2bBk58pg9rdsh_tvnd
comment: water vapor is added into the airstream through water heated evaporation using a propane heater
label: assistert propan @nb-no

Assisted Steam
type: Class
subclass of: Humidifier
comment: http://bsdd.buildingsmart.org/#concept/details/2INKwOIaXFgxGMKSsCa2Lm
comment: water vapor is added into the airstream through water heated evaporation using a steam heater
label: assistert damp @nb-no

Steam Injection
type: Class
subclass of: Humidifier
comment: http://bsdd.buildingsmart.org/#concept/details/05OOwwH2b5pwbQqrAayAR1
comment: water vapor is added into the airstream through direct steam injection
label: dampinjeksjon @nb-no

Interceptor
type: Class
subclass of: Flow Treatment Device
comment: A device designed and installed in order to separate and retain deleterious, hazardous or undesirable matter while permitting normal sewage or liquids to discharge into a collection system by gravity.
comment: http://bsdd.buildingsmart.org/#concept/details/11vN9pRrz0KQUNzVQ5_2RM
label: Abscheider @de-de

Cyclonic Interceptor
type: Class
subclass of: Interceptor
comment: http://bsdd.buildingsmart.org/#concept/details/2RxuKardj99Q$KLR33Cbq6
comment: removes larger liquid drops or larger solid particles
label: syklonisk @nb-no

Grease Interceptor
type: Class
subclass of: Interceptor
comment: chamber, on the line of a drain or discharge pipe, that prevents grease passing into a drainage system
comment: http://bsdd.buildingsmart.org/#concept/details/3LXDZRMqX6hBYYip97WFpr
label: fett @nb-no

Oil Interceptor
type: Class
subclass of: Interceptor
comment: http://bsdd.buildingsmart.org/#concept/details/0efFn8L559X8O9PLL0mkNu
comment: one or more chambers arranged to prevent the ingress of oil to a drain or sewer that retains the oil for later removal
label: olje @nb-no

Petrol Interceptor
type: Class
subclass of: Interceptor
comment: http://bsdd.buildingsmart.org/#concept/details/3AfygEMd1AwBWNHSyfyIiI

Junction Box
type: Class
subclass of: Flow Fitting
comment: An enclosure within which cables are connected. Cables may be members of an electrical circuit (for electrical power systems) or be information carriers (in a telecommunications system). Typically intended to conceal a cable junction from sight, eliminate tampering or provide a safe place for electrical connection.
comment: http://bsdd.buildingsmart.org/#concept/details/0kaRGER1f0o8KFilly53$b
label: Boite de jonction @fr-fr
label: Verbindungsdose @de-de

Data
type: Class
subclass of: Junction Box
comment: contains cables, outlets, and/or switches for communications use
comment: http://bsdd.buildingsmart.org/#concept/details/1mq782MKb1ZxoRYPK9Umy2
label: data @nb-no

Power
type: Class
subclass of: Junction Box
comment: http://bsdd.buildingsmart.org/#concept/details/2rfL__S75EcOfkEgBpZV_b
label: strømtilførsel @nb-no

Lamp
type: Class
subclass of: Flow Terminal
comment: An artificial light source such as a light bulb or tube.
comment: http://bsdd.buildingsmart.org/#concept/details/0ETiMxiX14xwxiqYleSsxj
label: Lampe @de-de
label: Leuchtmittel @de-de
label: lampe @fr-fr

Compact Fluorescent
type: Class
subclass of: Lamp
comment: http://bsdd.buildingsmart.org/#concept/details/3zxJlrQUXE3BF9p3XFK9sV

Fluorescent
type: Class
subclass of: Lamp
comment: a typically tubular discharge lamp in which most of the light is emitted by one or several layers of phosphors excited by ultraviolet radiation from the discharge.
comment: http://bsdd.buildingsmart.org/#concept/details/0V1bibu4L13Bts98Ganx3k
label: fluoriserende lampe @nb-no

Halogen
type: Class
subclass of: Lamp
comment: a gas-filled, high-intensity incandescent lamp containing a small amount of a halogen
comment: http://bsdd.buildingsmart.org/#concept/details/2EGers_2r5rBBnldpP0G_o
label: halogen @nb-no

High Pressure Mercury
type: Class
subclass of: Lamp
comment: a discharge lamp in which most of the light is emitted by exciting mercury at high pressure
comment: http://bsdd.buildingsmart.org/#concept/details/2QODll5IXBLOrmpb298AP_
label: høytrykk - bly lampe @nb-no

High Pressure Sodium
type: Class
subclass of: Lamp
comment: a discharge lamp in which most of the light is emitted by exciting sodium at high pressure
comment: http://bsdd.buildingsmart.org/#concept/details/1vX9Auimj7BfAyryFJkgkm
label: høytrykk - sodium @nb-no

LED
type: Class
subclass of: Lamp
comment: a light-emitting diode (LED) is a semiconductor device that emits visible light when an electric current passes through it.
comment: http://bsdd.buildingsmart.org/#concept/details/2mULGMKGf1cRYOSiyAofvb

Metal Halide
type: Class
subclass of: Lamp
comment: http://bsdd.buildingsmart.org/#concept/details/3esdl$BJXD9htEWoSEpsDg

OLED
type: Class
subclass of: Lamp
comment: a solid state lamp that uses light-emitting diodes as the source of light whose emissive electroluminescent layer is composed of a film of organic compounds
comment: http://bsdd.buildingsmart.org/#concept/details/2ga1cHzm5D$fItBN2Tozo9
label: oled @nb-no

Tungsten Filament
type: Class
subclass of: Lamp
comment: http://bsdd.buildingsmart.org/#concept/details/3n5ZYbHnnBuhtIMoheS78j

Light Fixture
type: Class
subclass of: Flow Terminal
comment: A container that is designed for the purpose of housing one or more lamps and optionally devices that control, restrict or vary their emission.
comment: http://bsdd.buildingsmart.org/#concept/details/1sxtfF6Gb1ieWm5Xy9aa5C
label: Fixation de lampe @fr-fr
label: Leuchte @de-de
label: Verlichtingsarmatuur @nl-nl
label: lysarmatur @nb-no

Direction Source
type: Class
subclass of: Light Fixture
comment: a light fixture that is considered to have a length or surface area from which it emits light in a direction. a light fixture containing one or more fluorescent lamps is an example of a direction source
comment: http://bsdd.buildingsmart.org/#concept/details/0XEOjAoQb8nAOs58mf0C7S
label: kilderetning @nb-no

Point Source
type: Class
subclass of: Light Fixture
comment: http://bsdd.buildingsmart.org/#concept/details/1bOvnRIgnDhuRposkK0D7b

Security Lighting
type: Class
subclass of: Light Fixture
comment: a light fixture having specific purpose of directing occupants in an emergency, such as an illuminated exit sign or emergency flood light
comment: http://bsdd.buildingsmart.org/#concept/details/3r7SZninH9Uh6FH$yz54Pl
label: sikkerhetsbelysning @nb-no

Medical Device
type: Class
subclass of: Flow Terminal
comment: A device is attached to a medical piping system and operates upon medical gases to perform a specific function. Medical gases include medical air, medical vacuum, oxygen, carbon dioxide, nitrogen, and nitrous oxide.
comment: http://bsdd.buildingsmart.org/#concept/details/1AkDu7dZb8l8V$ZCIldlOl
label: Equipement médical @fr-fr
label: Medizinisches Gerät @de-de
label: medisinsk utstyr @nb-no

Air Station
type: Class
subclass of: Medical Device
comment: device that provides purified medical air, composed of an air compressor and air treatment line
comment: http://bsdd.buildingsmart.org/#concept/details/3o0TKF$jb4JfwCg4jNP8QH
label: luftstasjon @nb-no

Feed Air Unit
type: Class
subclass of: Medical Device
comment: http://bsdd.buildingsmart.org/#concept/details/0L4vXkvln2MRDKPQngnIZ1

Oxygen Generator
type: Class
subclass of: Medical Device
comment: device that generates oxygen from air
comment: http://bsdd.buildingsmart.org/#concept/details/2beptDYcnFLwdWqGq$GWRC
label: oksygengenerator @nb-no

Oxygen Plant
type: Class
subclass of: Medical Device
comment: device that combines a feed air unit, oxygen generator, and backup oxygen cylinders
comment: http://bsdd.buildingsmart.org/#concept/details/2Z$pgegmf8Bv9ktRxYuUY7
label: oksygenanlegg @nb-no

Vacuum Station
type: Class
subclass of: Medical Device
comment: device that provides suction, composed of a vacuum pump and bacterial filtration line
comment: http://bsdd.buildingsmart.org/#concept/details/2qtw8iOMD6aQlRYJeE54Oe
label: vakuumstasjon @nb-no

Motor Connection
type: Class
subclass of: Energy Conversion Device
comment: The means for connecting a motor as the driving device to the driven device.
comment: http://bsdd.buildingsmart.org/#concept/details/1uD4xpI6rB28wdUvR8Y86u
label: Connection du moteur @fr-fr
label: Motoranschluss @de-de
label: Motorkoppeling @nl-nl
label: motorkobling @nb-no

Belt Drive Motor Connection
type: Class
subclass of: Motor Connection
comment: an indirect connection made through the medium of a shaped, flexible continuous loop
comment: http://bsdd.buildingsmart.org/#concept/details/337StHg8r5XxwkyT3aqNfr
label: beltedrevet @nb-no
label: drivbelte @nb-no

Coupling Motor Connection
type: Class
subclass of: Motor Connection
comment: an indirect connection made through the medium of the viscosity of a fluid
comment: http://bsdd.buildingsmart.org/#concept/details/2ztf_P39HBTfamG9J37o0l
label: kopling @nb-no

Direct Drive Motor Connection
type: Class
subclass of: Motor Connection
comment: a direct, physical connection made between the motor and the driven device
comment: http://bsdd.buildingsmart.org/#concept/details/26AgedTrrEsuQRrx2V_DY3
label: direktedrevet motor @nb-no

Outlet
type: Class
subclass of: Flow Terminal
comment: A device installed at a point to receive one or more inserted plugs for electrical power or communications.
comment: http://bsdd.buildingsmart.org/#concept/details/28QPmBjcbAuOHAWzJovXA6
label: Dose @de-de
label: Steckdose @de-de
label: prise @fr-fr
label: uttak @nb-no

Audiovisual Outlet
type: Class
subclass of: Outlet
comment: an outlet used for an audio or visual device
comment: http://bsdd.buildingsmart.org/#concept/details/0lKEDMjxLFNxLZF0uvQXvQ
label: audiovisuelt utgang @nb-no

Communications Outlet
type: Class
subclass of: Outlet
comment: an outlet used for connecting communications equipment
comment: http://bsdd.buildingsmart.org/#concept/details/3LRis6YOnAhO_2qLThy$7d
label: kommunikasjonuttak @nb-no

Data Outlet
type: Class
subclass of: Outlet
comment: an outlet used for connecting data communications equipment
comment: http://bsdd.buildingsmart.org/#concept/details/2nLbYVXBz2iPUzoVG9MSjL
label: datautgang @nb-no

Power Outlet
type: Class
subclass of: Outlet
comment: an outlet used for connecting electrical devices requiring power
comment: http://bsdd.buildingsmart.org/#concept/details/1VO3tI1Bn2AO1KWd3ZVGi6
label: strømuttak @nb-no

Telephone Outlet
type: Class
subclass of: Outlet
comment: an outlet used for connecting telephone communications equipment
comment: http://bsdd.buildingsmart.org/#concept/details/3sQmISw8154AzAhVrfw8CI
label: telekommunikasjonsuttak @nb-no

Pipe Fitting
type: Class
subclass of: Flow Fitting
comment: A junction or transition in a piping flow distribution system used to connect pipe segments, resulting in changes in flow characteristics to the fluid such as direction or flow rate. Includes elbows, junctions, manifolds, and plumbing boxes.
comment: http://bsdd.buildingsmart.org/#concept/details/36UVu0qV8HuO00025QrE$V
label: Rohrverbinder @de-de
label: raccord de tuyauterie @fr-fr
label: rørdel @nb-no

Bend
type: Class
subclass of: Pipe Fitting
comment: A fitting for joining the down-pipe in different angles pass blockings
comment: Bend albue @nb-no
comment: Bend, albue @nb-no
comment: En innretning for å skjøte nedløpsrøret i ulike vinkler forbi hindringer @nb-no
comment: a fitting with typically two ports used to change the direction of flow between connected elements
comment: http://bsdd.buildingsmart.org/#concept/details/0_1uLp$45FjOqNjel4YBnY
comment: http://bsdd.buildingsmart.org/#concept/details/11IUzA0c9C9gGPcD6wjcm8
comment: http://bsdd.buildingsmart.org/#concept/details/2ScGOKl0TF58sYPFb6KHbc
comment: http://bsdd.buildingsmart.org/#concept/details/2VSwjMBw1DguPAi2T4j5Vo
comment: http://bsdd.buildingsmart.org/#concept/details/2Wxblu6ePDPQ1joWCcVscx
comment: http://bsdd.buildingsmart.org/#concept/details/3$QIJ5gKv4hPazehz8XSJr
comment: http://bsdd.buildingsmart.org/#concept/details/3qojuW1k5C89_5p3vK7la0
comment: http://bsdd.buildingsmart.org/#concept/details/3vHSO0oT0Hsm00051Mm008
label: Krümmer @de-de
label: bend @nb-no
label: bend brannslokking inertgass @nb-no
label: bend brannslukking vann @nb-no
label: bend bunnledning sanitær @nb-no
label: bend gassinstallasjon @nb-no
label: bend gassinstallasjon virksomhet @nb-no
label: bend pipeline sanitation
label: bend sanitær @nb-no
label: brannslokkingbend for tåke @nb-no
label: brannslukkingbend for sprinkler @nb-no
label: coude @fr-fr
label: elbows
label: rørbend @nb-no
label: tee gas installation

Connector
type: Class
subclass of: Pipe Fitting
comment: device generally consisting of a plate, toothed-plate or ring which, when partly embedded in each or in one of the contact faces of two members and held together by a connecting bolt, is capable of transmitting a load from one member to another
comment: http://bsdd.buildingsmart.org/#concept/details/3tvMvSswv0Dw7HoTwOQYKj
comment: innretning som vanligvis består av en plate, en fortannet plate eller en ring, og som, når den er delvis trengt inn i alle eller i en av kontaktflatene på to komponenter og holdt sammen med en bolt, er i stand til å overføre en last fra en komponent til e @nb-no
label: Dübel @de-de
label: connecteur @fr-fr
label: forbindelse @nb-no
label: forbindelsesledd @nb-no
label: forbinder @nb-no

Entry
type: Class
subclass of: Pipe Fitting
comment: entry fitting, typically unconnected at one port and connected to a flow distribution system at the other (e.g., a breeching inlet)
comment: entry fitting, typically unconnected at one port and connected to a flow distribution system at the other (e.g., an outside air duct system intake opening)
comment: http://bsdd.buildingsmart.org/#concept/details/3iMmwy9iv0SBFB7w4cNsVs
label: inngang @nb-no

Exit
type: Class
subclass of: Pipe Fitting
comment: http://bsdd.buildingsmart.org/#concept/details/1vLJsY3MX6I8Ss72zp5sN_
label: utgang @nb-no

Junction
type: Class
subclass of: Pipe Fitting
comment: a fitting with typically more than two ports used to redistribute flow among the ports and/or to change the direction of flow between connected elements (e.g, tee, cross, wye, etc.)
comment: a fitting with typically more than two ports used to redistribute flow among the ports and/or to change the direction of flow between connected elements (e.g, tee, cross, wye, etc.).
comment: http://bsdd.buildingsmart.org/#concept/details/2OzMql95b8ouXEzC1oYarB
label: gren @nb-no
label: grenrør @nb-no
label: kryss @nb-no

Obstruction
type: Class
subclass of: Pipe Fitting
comment: http://bsdd.buildingsmart.org/#concept/details/2gXay6NOz7NPfYIUbDxtmF
label: hindring @nb-no

Transition
type: Class
subclass of: Pipe Fitting
comment: http://bsdd.buildingsmart.org/#concept/details/0mLpncHvn8AguL5g1sYDP7
label: overgang @nb-no

Pipe Segment
type: Class
subclass of: Flow Segment
comment: A segment is used to typically join two sections of a piping network.
comment: http://bsdd.buildingsmart.org/#concept/details/27v4E0qV8HuO00025QrE$V
label: Rohr @de-de
label: Tronçon de tuyauterie @fr-fr
label: rørdel @nb-no

Culvert
type: Class
subclass of: Pipe Segment
comment: http://bsdd.buildingsmart.org/#concept/details/0kbHQAKHrDHfD6TQOe$Myu
label: kulvert @nb-no

Flexible Pipe Segment
type: Class
subclass of: Pipe Segment
comment: http://bsdd.buildingsmart.org/#concept/details/0bMKZ$AyPEsOOwHPCXcOcT
label: fleksibel delflate @nb-no
label: fleksibel rørdel @nb-no

Gutter
type: Class
subclass of: Pipe Segment
comment: A gutter situated outside the building and supported by brackets
comment: En renne som støttes av rennekroker og som er plassert på utsiden av bygningen for å lede bort regnvann. @nb-no
comment: Takrenne @nb-no
comment: http://bsdd.buildingsmart.org/#concept/details/2deKArJfvCcR42exJCfGfR
label: eaves gutter
label: renne @nb-no
label: takrenne @nb-no

Rigid Pipe Segment
type: Class
subclass of: Pipe Segment
comment: a rigid segment is a continuous linear segment of pipe that cannot be deformed
comment: http://bsdd.buildingsmart.org/#concept/details/0oZaW79IT5rfrDH337Wczh
label: stiv delflate @nb-no

Spool
type: Class
subclass of: Pipe Segment
comment: a type of rigid segment that is typically shorter and used for providing connectivity within a piping network
comment: http://bsdd.buildingsmart.org/#concept/details/1XnqgBB0b5Ehi3OXV3HNVt

Protective Device
type: Class
subclass of: Flow Controller
comment: A device breaks an electrical circuit when a stated electric current that passes through it is exceeded. Provides protection against electrical current only (not as a general protective device).
comment: http://bsdd.buildingsmart.org/#concept/details/127XSeDXvD5haPLRkC8eyd
label: Sicherung @de-de
label: beskyttende enhet @nb-no
label: équipement de protection @fr-fr

Circuit Breaker
type: Class
subclass of: Protective Device
comment: http://bsdd.buildingsmart.org/#concept/details/3EWAB3Ur5Cng3zn8b4wZEE
label: strømbryter @nb-no

Earthing Switch
type: Class
subclass of: Protective Device
comment: a safety device used to open or close a circuit when there is no current. used to isolate a part of a circuit, a machine, a part of an overhead line or an underground line so that maintenance can be safely conducted
comment: http://bsdd.buildingsmart.org/#concept/details/2q5Q9N9Az1Oh7iRLNISzdt
label: jordingsbryter @nb-no

Earth Leakage Circuit Breaker
type: Class
subclass of: Protective Device
comment: a device that opens, closes, or isolates a circuit and has short circuit protection but no overload protection. it attempts to break the circuit when there is a leakage of current from phase to earth, by measuring voltage on the earth conductor
comment: http://bsdd.buildingsmart.org/#concept/details/2h1MphDsfAOOGX2jycslmC
label: lekkstrømsikring @nb-no

Fuse Disconnector
type: Class
subclass of: Protective Device
comment: a device that will electrically open the circuit after a period of prolonged, abnormal current flow
comment: http://bsdd.buildingsmart.org/#concept/details/2TfJqRtl5EbAjQ1_2wg3W9
label: sikringskopling @nb-no

Residual Current Circuit Breaker
type: Class
subclass of: Protective Device
comment: http://bsdd.buildingsmart.org/#concept/details/2RbnT6FAn6fxAlZWiSgJ_I

Residual Current Switch
type: Class
subclass of: Protective Device
comment: a device that opens, closes or isolates a circuit and has no short circuit or overload protection. May also be identified as a 'ground fault switch'
comment: http://bsdd.buildingsmart.org/#concept/details/1P$J7BP319XvA_F1$sO9sN
label: reststrømsbryter @nb-no

Varistor
type: Class
subclass of: Protective Device
comment: a high voltage surge protection device
comment: http://bsdd.buildingsmart.org/#concept/details/3DtLJ1DjT4LOUFArBkjO_e
label: varistor @nb-no

Protective Device Tripping Unit
type: Class
subclass of: Distribution Control Element
comment: A protective device breaks an electrical circuit at a separate breaking unit when a stated electric current that passes through the unit is exceeded.
comment: http://bsdd.buildingsmart.org/#concept/details/2XAj9nULf1_vBAY_PiQTNv
label: Sicherungsschalter @de-de
label: Unité de déclenchement d'équipement de protection @fr-fr
label: beskyttende aktiveringsenhet @nb-no

Electro-magnetic
type: Class
subclass of: Protective Device Tripping Unit
comment: a tripping unit activated by electromagnetic action
comment: http://bsdd.buildingsmart.org/#concept/details/1snzfjLSb6VxQ6A4KikKSh
label: elektromagnetisk @nb-no

Electronic
type: Class
subclass of: Protective Device Tripping Unit
comment: a tripping unit activated by electronic action
comment: http://bsdd.buildingsmart.org/#concept/details/3LipcBG$z8SuRRCttfOFHZ
label: elektronisk @nb-no

Residual Current
type: Class
subclass of: Protective Device Tripping Unit
comment: a tripping unit activated by residual current detection.
comment: http://bsdd.buildingsmart.org/#concept/details/09h4iCV3XArhCUFOXrUJzB
label: jording @nb-no

Thermal
type: Class
subclass of: Protective Device Tripping Unit
comment: a tripping unit activated by thermal action
comment: http://bsdd.buildingsmart.org/#concept/details/1xk5ZOrXj7hxv7ViGvtyU$
label: termisk aktiveringsenhet @nb-no

Pump
type: Class
subclass of: Flow Moving Device
comment: A device which imparts mechanical work on fluids to move them through a channel or pipe.
comment: An equipment driven by a prime mover in which energy is either constantly or periodically added to an amount of pumped liquid in order to increase the pressure requiered for the process in which the pump is in operation.
comment: http://bsdd.buildingsmart.org/#concept/details/1xPUW0qVuHuO00025QrE$V
label: Pumpe @da
label: pomp @nl-nl
label: pompe @fr-fr
label: pump
label: pumpe @nb-no

Circulator Pump
type: Class
subclass of: Pump
comment: a circulator pump is a generic low-pressure, low-capacity pump. it may have a wet rotor and may be driven by a flexible-coupled motor
comment: http://bsdd.buildingsmart.org/#concept/details/3FNSRucOX3Mfl_kibtqQRr
label: sirkulasjonspumpe @nb-no

End Suction Pump
type: Class
subclass of: Pump
comment: an end suction pump, when mounted horizontally, has a single horizontal inlet on the impeller suction side and a vertical discharge. it may have a direct or close-coupled motor
comment: http://bsdd.buildingsmart.org/#concept/details/10iAdjK6fEqxsxJnj_WSZS
label: aksialt innløp @nb-no

Split Case Pump
type: Class
subclass of: Pump
comment: a split case pump, when mounted horizontally, has an inlet and outlet on each side of the impeller. the impeller can be easily accessed by removing the front of the impeller casing. It may have a direct or close-coupled motor
comment: http://bsdd.buildingsmart.org/#concept/details/3HSu1GQ8T9gQrSbYugJB2f
label: splitcase pumpe @nb-no

Submersible Pump
type: Class
subclass of: Pump
comment: http://bsdd.buildingsmart.org/#concept/details/0rpKGArwf1S8H9bk1lkPiT

Sump Pump
type: Class
subclass of: Pump
comment: a pump designed to sit above a collection tank with a suction inlet extending into the tank
comment: http://bsdd.buildingsmart.org/#concept/details/2WUDpiKfDE5u4DZMLBdExr
label: tørroppstilt pumpe @nb-no

Vertical Inline
type: Class
subclass of: Pump
comment: a vertical Inline pump has the pump and motor close-coupled on the pump casing. the pump depends on the connected, horizontal piping for support, with the suction and discharge along the piping axis
comment: http://bsdd.buildingsmart.org/#concept/details/0J3vLYrIDCfQEZZ8ZeRATw
comment: http://bsdd.buildingsmart.org/#concept/details/0VvmpeacrFf8rnDj2jyghe
label: vertikallinje @nb-no

Vertical Turbine
type: Class
subclass of: Pump
comment: a vertical turbine pump has a motor mounted vertically on the pump casing for either wet-pit sump mounting or dry-well mounting
comment: http://bsdd.buildingsmart.org/#concept/details/3Ld4kSekL8MOEqs2litt5v
label: vertikalpumpe @nb-no

Sanitary Terminal
type: Class
subclass of: Flow Terminal
comment: A fixed appliance or terminal usually supplied with water and used for drinking, cleaning or foul water disposal or that is an item of equipment directly used with such an appliance or terminal.
comment: http://bsdd.buildingsmart.org/#concept/details/2JIcddz_X75xhHc1XUv7d2
label: Equipement sanitaire @fr-fr
label: Sanitair toestel @nl-nl
label: Sanitäreinrichtung @de-de
label: sanitærstasjon @nb-no

Bath
type: Class
subclass of: Sanitary Terminal
comment: Badekar @nb-no
comment: Badekar, generisk, modelleres av ARK i tidlig fase @nb-no
comment: Sanitärobjekt, das der persönlichen Hygiene, vorzugsweise dem Baden und vollständigen Reinigen des menschlichen Körpers dient und mit das Wasser nach dem Gebrauch über ein Ablaufloch abgeleitet werden kann @de-de
comment: badekar, generisk, arkitekttegnede modeller i tidlige designfaser @dk-dk
comment: badkar, allmänt, arkitektens modeller under utformningens första steg @sv-se
comment: baignoire, générique, modeles par l'architecte dans les premières étapes de la conception @fr-fr
comment: http://bsdd.buildingsmart.org/#concept/details/3obubztQ19OANL1cKUM33Z
comment: sanitary appliance used for partial immersion and washing of the human body or parts of it, and for directing water to a waste outlet after use
comment: sanitærinnretning som brukes for delvis nedsenking og vasking av menneskekropp eller deler av den, og for å lede vann til et avløp etter bruk @nb-no
comment: varhaisten arkkitehtisuunnitteluvaiheiden yleismalliset kylpyammeet @fi-fi
label: Badewanne @de-de
label: bad @dk-dk
label: badekar @nb-no
label: badekar generisk @nb-no
label: baignoire @fr-fr
label: bath
label: bathtub
label: kylpyamme @fi-fi
label: wanna @pl-pl

Bidet
type: Class
subclass of: Sanitary Terminal
comment: Waste water appliance for washing the excretory organs while sitting astride the bowl
comment: http://bsdd.buildingsmart.org/#concept/details/1OsGeXUlz249AKQbE4k_3S
comment: waste water appliance for washing the excretory organs while sitting astride the bowl
label: bidè @nb-no
label: bidé @nb-no

Cistern
type: Class
subclass of: Sanitary Terminal
comment: A water storage unit attached to a sanitary terminal that is fitted with a device, operated automatically or by the user, that discharges water to cleanse a water closet (toilet) pan, urinal or slop hopper
comment: http://bsdd.buildingsmart.org/#concept/details/2jTiagbH96wBuf5tVceOCR
label: sisterne @nb-no

Sanitary Fountain
type: Class
subclass of: Sanitary Terminal
comment: http://bsdd.buildingsmart.org/#concept/details/3sjNvgHdPAH8fM1jgV3823
label: drikkefontene @nb-no

Shower
type: Class
subclass of: Sanitary Terminal
comment: Dusj beskyttet med kabinett @nb-no
comment: Dusjhjørne @nb-no
comment: Shower installed in its own cabinet
comment: http://bsdd.buildingsmart.org/#concept/details/0epJRcLij1_O8OcMA6Y0WR
label: dusj @nb-no
label: dusjhjørne @nb-no
label: dusjkabinett @nb-no
label: shower cabinet

Sink
type: Class
subclass of: Sanitary Terminal
comment: Servant @nb-no
comment: Servant, generisk, modelleres av ARK i tidlig fase @nb-no
comment: Vanlig stor @nb-no
comment: beholder for vann under kran til vasking av hender og ansikt @nb-no
comment: container for water located below water dispenser, used for washing hands and face
comment: http://bsdd.buildingsmart.org/#concept/details/1SP1BV0Wj9lf1y$D1yvjLF
label: kjøkken @nb-no
label: servant @nb-no
label: servant generisk @nb-no
label: utslagsvask @nb-no
label: vask @nb-no
label: wash basin

Toilet Pan
type: Class
subclass of: Sanitary Terminal
comment: http://bsdd.buildingsmart.org/#concept/details/2DXU$3jIrFROZFEhM3vmoY
comment: soil appliance for the disposal of excrement
label: toalettskål @nb-no

Urinal
type: Class
subclass of: Sanitary Terminal
comment: http://bsdd.buildingsmart.org/#concept/details/2B1zvMQAv9pPzzlnNtd5xA
comment: soil appliance that receives urine and directs it to a waste outlet
label: urinal @nb-no

Wash Hand Basin
type: Class
subclass of: Sanitary Terminal
comment: http://bsdd.buildingsmart.org/#concept/details/2FTLxQE_19NPX9OHQSeAff
comment: waste water appliance for washing the upper parts of the body
label: håndvask @nb-no

WC Seat
type: Class
subclass of: Sanitary Terminal
comment: hinged seat that fits on the top of a water closet (WC) pan
comment: http://bsdd.buildingsmart.org/#concept/details/12WSI21rv3UfKISz44T3B5
label: toalettsete @nb-no

Capteur
type: Class
subclass of: Distribution Control Element
comment: A device that measures a physical quantity and converts it into a signal which can be read by an observer or by an instrument.
comment: http://bsdd.buildingsmart.org/#concept/details/0fBybaDK56PuAX2mD3nQsg
label: Sensor
label: sensor @nb-no

CO2Sensor
type: Class
subclass of: Capteur

Conductance Sensor
type: Class
subclass of: Capteur
comment: http://bsdd.buildingsmart.org/#concept/details/3B3V_G55z9nPyFZOVtZKu9

Contact Sensor
type: Class
subclass of: Capteur
comment: http://bsdd.buildingsmart.org/#concept/details/37ufVjEi1BZwCCYTaYZdgK

Fire Sensor
type: Class
subclass of: Capteur
comment: http://bsdd.buildingsmart.org/#concept/details/1uUUJfLpX03uy3ZC8j0YXd

Flow Sensor
type: Class
subclass of: Capteur
comment: http://bsdd.buildingsmart.org/#concept/details/0uovCUrpn9leYila3fCeEN

Frost Sensor
type: Class
subclass of: Capteur

Gas Sensor
type: Class
subclass of: Capteur
comment: http://bsdd.buildingsmart.org/#concept/details/2EQoz$FyT5_wpwhtQt6Bt2

Heat Sensor
type: Class
subclass of: Capteur
comment: http://bsdd.buildingsmart.org/#concept/details/3Op4_nqmj6L96LAusX1Ytq

Humidity Sensor
type: Class
subclass of: Capteur
comment: http://bsdd.buildingsmart.org/#concept/details/3Pza_zqrDAwg4Pv44MusVg

Identifier Sensor
type: Class
subclass of: Capteur

Ion Concentration Sensor
type: Class
subclass of: Capteur
comment: http://bsdd.buildingsmart.org/#concept/details/2MglfdfcTCuhCN57KBKgPd

Level Sensor
type: Class
subclass of: Capteur
comment: http://bsdd.buildingsmart.org/#concept/details/2zHVmDmGT6zBRJIAqmQdkK

Light Sensor
type: Class
subclass of: Capteur
comment: http://bsdd.buildingsmart.org/#concept/details/3Y5B9ubBb0xxK9qw_nEkEk

Moisture Sensor
type: Class
subclass of: Capteur
comment: http://bsdd.buildingsmart.org/#concept/details/1LnA01HA5E7fPuuXLI2ZjZ

Movement Sensor
type: Class
subclass of: Capteur
comment: http://bsdd.buildingsmart.org/#concept/details/2$qvwDkgL0VRFBeuD9w9Si

PH-Sensor
type: Class
subclass of: Capteur
comment: http://bsdd.buildingsmart.org/#concept/details/3lwBxJbnL9DAvFoYtIB3Li

Pressure Sensor
type: Class
subclass of: Capteur
comment: http://bsdd.buildingsmart.org/#concept/details/2RKICtIin2Rw5EFR0Z2J9j

Radiation Sensor
type: Class
subclass of: Capteur
comment: http://bsdd.buildingsmart.org/#concept/details/3OXFVvFvPCePgxMcTylRzf

Radioactivity Sensor
type: Class
subclass of: Capteur
comment: http://bsdd.buildingsmart.org/#concept/details/0wp1vLqNP9Lef8Pba4UI6P

Smoke Sensor
type: Class
subclass of: Capteur
comment: http://bsdd.buildingsmart.org/#concept/details/05gekqn$D9nA81S2HC8u1E

Sound Sensor
type: Class
subclass of: Capteur
comment: http://bsdd.buildingsmart.org/#concept/details/0OvllOM7fDC8GX67w3ESF6

Temperature Sensor
type: Class
subclass of: Capteur
comment: http://bsdd.buildingsmart.org/#concept/details/2SmjV_2JXB4wdmD4Bzr$BP

Wind Sensor
type: Class
subclass of: Capteur
comment: http://bsdd.buildingsmart.org/#concept/details/1hMN0c8Rj5dw$7eow$VjWU

Solar Device
type: Class
subclass of: Energy Conversion Device
comment: A device converts solar radiation into other energy such as electric current or thermal energy.
comment: http://bsdd.buildingsmart.org/#concept/details/10kbcLuh91TeNXCNVtFC6g
label: Solargerät @de-de
label: capteur solaire @fr-fr
label: solenergienhet @nb-no

Solar Collector
type: Class
subclass of: Solar Device
comment: http://bsdd.buildingsmart.org/#concept/details/0fo0nZHmT5twFp0u9haG2I

Solar Panel
type: Class
subclass of: Solar Device
comment: a device that converts solar radiation into electric current
comment: http://bsdd.buildingsmart.org/#concept/details/2S$Xvvjqn1GAvVFoENZhtk
label: solpanel @nb-no

Space Heater
type: Class
subclass of: Flow Terminal
comment: Heaters utilize a combination of radiation and/or natural convection using a heating source such as electricity, steam or hot water to heat a limited space or area. Examples of space heaters include radiators, convectors, baseboard and finned-tube heaters.
comment: http://bsdd.buildingsmart.org/#concept/details/39lbLJ2412vOKf6Cp8ojJd
label: Heizkörper @de-de
label: heater
label: kachel @nl-nl
label: local heating device
label: lokaal verwarmingstoestel @nl-nl
label: radiateur @fr-fr
label: ruimteverwarmingstoestel @nl-nl
label: varmeenhet @nb-no

Convector
type: Class
subclass of: Space Heater
comment: a heating appliance which emits heat almost entirely by convection. a convector comprises at least a heat emitter and a casing which provides an unheated convective chimney of defined height.
comment: http://bsdd.buildingsmart.org/#concept/details/0kMkKT22f00BAkHfSQ7c_B
label: konvektor @nb-no
label: varmekonvektor @nb-no

Heizkörper
type: Class
subclass of: Space Heater
comment: a heat appliance which emits heat by free convection and radiation
comment: http://bsdd.buildingsmart.org/#concept/details/38a4eei5j5vQs7YtSb7quf
label: Radiator
label: radiateur @fr-fr
label: radiator @nb-no
label: varmelegeme @nb-no

Stack Terminal
type: Class
subclass of: Flow Terminal
comment: A terminal placed at the top of a ventilating stack (such as to prevent ingress by birds or rainwater) or rainwater pipe (to act as a collector or hopper for discharge from guttering).
comment: http://bsdd.buildingsmart.org/#concept/details/0lNPT0EPbBWeJB7HGeHjgH
label: Rohrabdeckung @de-de
label: system-terminal @nb-no

Birdcage
type: Class
subclass of: Stack Terminal
comment: guard cage, typically wire mesh, at the top of the stack preventing access by birds
comment: http://bsdd.buildingsmart.org/#concept/details/2yx3o8h5157elNsihhcZZx
label: ventilasjon gitter topp @nb-no

cowl
type: Class
subclass of: Stack Terminal
comment: air terminal device intended to be installed above a natural ventilation exhaust duct with the aim, by creating negative pressure and depending on wind speed, of avoiding reverse flow and increasing flow rate
comment: http://bsdd.buildingsmart.org/#concept/details/3XIKqh6OnDLvtnQcrmQvo4
label: hette @nb-no
label: vent cap
label: vent turbine
label: ventilasjonstopp @nb-no

Rainwater Hopper
type: Class
subclass of: Stack Terminal
comment: http://bsdd.buildingsmart.org/#concept/details/0tlwEdOcDExuy98lwa6_38

Switching Device
type: Class
subclass of: Flow Controller
comment: A switch used in a cable distribution system (electrical circuit) to control or modulate the flow of electricity. Include those used for electrical power, communications, audio-visual, or other distribution system types as determined by the available ports.
comment: http://bsdd.buildingsmart.org/#concept/details/0JjKezzH55POBG1espn8W$
label: Interrupteur @fr-fr
label: Schalter @de-de
label: bryter @nb-no

Contactor
type: Class
subclass of: Switching Device
comment: http://bsdd.buildingsmart.org/#concept/details/3rxqi3mzn8ovp5j4$AtKpj
comment: mechanical switching device having only one position of rest, operated otherwise than by hand, capable of making, carrying and breaking currents under normal circuit conditions including operating overload conditions
label: Contactstop @nl-nl
label: kontaktor @nb-no

Dimmer Switch
type: Class
subclass of: Switching Device
comment: http://bsdd.buildingsmart.org/#concept/details/2Qsa6P6719HRwY$4OSoDq9

Emergency Stop
type: Class
subclass of: Switching Device
comment: http://bsdd.buildingsmart.org/#concept/details/1AkYCx5WrDfQSeajQs4GbK

Keypad
type: Class
subclass of: Switching Device
comment: http://bsdd.buildingsmart.org/#concept/details/30Wun_rrP3hg09kZxKFSxo
comment: а set of buttons or switches, each potentially applicable to a different device
label: tastatur @nb-no

Momentary Switch
type: Class
subclass of: Switching Device
comment: http://bsdd.buildingsmart.org/#concept/details/1GXuot6Zv41wgJSbaoN8g7
comment: а momentary switch has no position, and may trigger some action to occur
label: momentantbryter @nb-no

Selector Switch
type: Class
subclass of: Switching Device
comment: http://bsdd.buildingsmart.org/#concept/details/2WULe4Kq50n8t1M8n_T5Jc

Starter
type: Class
subclass of: Switching Device
comment: http://bsdd.buildingsmart.org/#concept/details/2R7sKp3Zz8EvRVJenaoFA0
comment: а starter is a switch which in the closed position controls the application of power to an electrical device
label: starter @nb-no

Switch Disconnector
type: Class
subclass of: Switching Device
comment: http://bsdd.buildingsmart.org/#concept/details/2YJHtgvof1aQ6qN28MCYJh

Toggle Switch
type: Class
subclass of: Switching Device
comment: http://bsdd.buildingsmart.org/#concept/details/2OMieHhU5ClBrIpriDbqmz

Tank
type: Class
subclass of: Flow Storage Device
comment: A vessel or container in which a fluid or gas is stored for later use.
comment: http://bsdd.buildingsmart.org/#concept/details/2UJCW0qWyHuO00025QrE$V
label: réservoir @fr-fr
label: tank @nb-no

Basin
type: Class
subclass of: Tank
comment: an arbitrary open tank type
comment: http://bsdd.buildingsmart.org/#concept/details/2Kr7mfp3HFAfi67PdLwE0L
label: servant @nb-no
label: tank type basseng @nb-no

Break Pressure Tank
type: Class
subclass of: Tank
comment: an open container that breaks the hydraulic pressure in a distribution system, typically located between the fluid reservoir and the fluid supply points. a typical break pressure tank allows the flow to discharge into the atmosphere, thereby reducing its hydrostatic pressure to zero
comment: http://bsdd.buildingsmart.org/#concept/details/1uUiVD63rEcPif0cejL9Vx
label: Bruddtrykk @nb-no

Expansion Tank
type: Class
subclass of: Tank
comment: a closed container used in a closed fluid distribution system to mitigate the effects of thermal expansion or water hammer. the tank is typically constructed with a diaphragm dividing the tank into two sections, with fluid on one side of the diaphragm and air on the other. one example application is when connected to the primary circuit of a hot water system to accommodate the increase in volume of the water when it is heated
comment: http://bsdd.buildingsmart.org/#concept/details/1Lw1_wSbzFWe1SaTJeinCg
label: ekspansjon @nb-no

Feed And Expansion Tank
type: Class
subclass of: Tank
comment: http://bsdd.buildingsmart.org/#concept/details/371WHCLHb6vgWMDDSDFW4f
label: mate og ekspansjonstank @nb-no

Pressure Vessel
type: Class
subclass of: Tank
comment: http://bsdd.buildingsmart.org/#concept/details/3pBTMtMgH5UOIRcXURYkQd
label: trykktank @nb-no

Storage Tank
type: Class
subclass of: Tank
comment: http://bsdd.buildingsmart.org/#concept/details/36ZG4Tdk1CARQ9FrH0BlZe
label: lagringstank @nb-no

Vessel
type: Class
subclass of: Tank
comment: an arbitrary closed tank type
comment: http://bsdd.buildingsmart.org/#concept/details/2rdBMMRl56p9qdnIOKnbwO
label: beholder @nb-no

Transformer
type: Class
subclass of: Energy Conversion Device
comment: A artefact that transfers electric energy without change of frequency
comment: An inductive stationary device that transfers electrical energy from one circuit to another.
comment: Een statische energieomzetter die elektrische energie energie omzet zonder verandering van frequentie. @nl-nl
comment: Een toestel dat door elektromagnetische inductie één of meer veranderlijke stromen en spanningen omzet in één of meer verandelijke stromen en spanningen zonder dat voor de omzetting bewegende delen nodig zijn. @nl-nl
comment: Een transformator (veelal afgekort tot trafo (NL) of transfo (B)) is een statisch (d.w.z. zonder bewegende onderdelen) elektrisch apparaat, bestaande uit magnetisch gekoppelde spoelen. Stuurt men een veranderlijke stroom door een van de spoelen, de primaire spoel genoemd, dan wordt in de andere spoel(en), de secundaire, een spanning opgewekt. @nl-nl
comment: Elektrisch apparaat die elektrische wisselstroomenergie van een bepaald spanningsniveau en aantal fasen via magnetisch gekoppelde spoelen omzet in energie van een ander spanningsniveau, maar met dezelfde frequentie. @nl-nl
comment: Elektrisch apparaat waarmee spanning en stroom kunnen worden omgezet van hoge naar lage waarden. In de elektrotechniek een omzetter die elektrische wisselstroomenergie van een bepaald spanningsniveau en aantal fasen omzet in energie van een ander spanningsniveau, maar met dezelfde frequentie. @nl-nl
comment: http://bsdd.buildingsmart.org/#concept/details/1d7Az5cjf79B356TXokPOF
comment: static piece of apparatus with two or more windings which, by electromagnetic induction, transforms a system of alternating voltage and current into another system of voltage and current usually of different values and at the same frequency for the purpose of transmitting electrical power
comment: static piece of apparatus with two or more windings which, by electromagnetic induction, transforms a system of alternating voltage and current into another system of voltage and current usually of different values and at the same frequency for the purpose of transmitting electrical power. (NEN-EN-IEC 61558-1)
label: transformateur @fr-fr
label: transformator @de-de

Current Transformer
type: Class
subclass of: Transformer
comment: a transformer that changes the current between circuits
comment: http://bsdd.buildingsmart.org/#concept/details/0S1LeIGoj1CwsRLj4IxJSx
label: strøm @nb-no

Frequency Transformer
type: Class
subclass of: Transformer
comment: a transformer that changes the frequency between circuits
comment: http://bsdd.buildingsmart.org/#concept/details/1UAFNuQt5E0xPmuu4GQLrJ
label: frekvens @nb-no

Inverter Transformer
type: Class
subclass of: Transformer
comment: device for the conversion of direct current (DC) to alternating current (AC)
comment: http://bsdd.buildingsmart.org/#concept/details/1JVDHhnQb3Hv0o3sTOfXt3
label: retter @nb-no

Rectifier Transformer
type: Class
subclass of: Transformer
comment: electric energy converter that changes single-phase or polyphase alternating electric currents to unidirectional current
comment: http://bsdd.buildingsmart.org/#concept/details/0J1BEZtan5FAXomnB0QhUR
label: likeretter @nb-no
label: likeretter - transformator @nb-no

Voltage Transformer
type: Class
subclass of: Transformer
comment: a transformer that changes the voltage between circuits
comment: http://bsdd.buildingsmart.org/#concept/details/1_4pUL3mX9fwVKh_9lcz1S
label: spenning @nb-no

Tube Bundle
type: Class
subclass of: Energy Conversion Device
comment: A device consisting of tubes and bundles of tubes used for heat transfer and contained typically within other energy conversion devices, such as a chiller or coil.
comment: An assembly of tubes constituting a part of a shell and tube heat exchanger. The tubes are in each end collected in a tube sheet.
comment: http://bsdd.buildingsmart.org/#concept/details/2KKY0IUEj0J9jguEJqOHcm
label: Buizenregister @nl-nl
label: Faisceau tubulaire @fr-fr
label: Rohrbündel @de-de
label: rørbunt @nb-no

Finned Tube Bundle
type: Class
subclass of: Tube Bundle
comment: http://bsdd.buildingsmart.org/#concept/details/300_kyP4z8lfGEZ8$LKgLE
label: ribberør @nb-no

Unitary Control Element
type: Class
subclass of: Distribution Control Element
comment: A control element combines a number of control components into a single product, such as a thermostat or humidistat. Provides a housing for an aggregation of control or electrical distribution elements that, in combination, perform a singular (unitary) purpose. Each item in the aggregation may have its own geometric representation and location.
comment: http://bsdd.buildingsmart.org/#concept/details/1K4LPg0kL5k8UuFp4BB3Q9
label: Einheitsregler @de-de
label: Elément de contrôle unitaire @fr-fr
label: enhetlig kontroll @nb-no

Alarm Panel
type: Class
subclass of: Unitary Control Element
comment: http://bsdd.buildingsmart.org/#concept/details/2E$a0foIL9GhqKHxJcRSkz

Control Panel
type: Class
subclass of: Unitary Control Element
comment: a control element at which devices that control or monitor the operation of a site, building or part of a building are located
comment: http://bsdd.buildingsmart.org/#concept/details/0szSYD3cD3$ucQuwpURDzs
label: kontrollpanel @nb-no

Gas Detection Panel
type: Class
subclass of: Unitary Control Element
comment: http://bsdd.buildingsmart.org/#concept/details/26McOeRsjAPOMMV393Pkuv

Humidistat
type: Class
subclass of: Unitary Control Element
comment: a control element that senses and regulates the humidity of a system or space so that the humidity is maintained near a desired setpoint.
comment: http://bsdd.buildingsmart.org/#concept/details/3duRJz_NHBsO8tukebn0Br
label: hygrostat @nb-no

Indicator Panel
type: Class
subclass of: Unitary Control Element
comment: http://bsdd.buildingsmart.org/#concept/details/3wAtS33ID4zuEOa3x02EIn
comment: а control element at which equipment operational status, condition, safety state or other required parameters are indicated
label: indikatorpanel @nb-no

Mimic Panel
type: Class
subclass of: Unitary Control Element
comment: http://bsdd.buildingsmart.org/#concept/details/2gW6eFlD1A7Qnqh99Dspb0
comment: а control element at which information that is available elsewhere is repeated or 'mimicked'
label: mimikkpanel @nb-no

Thermostat
type: Class
subclass of: Unitary Control Element
comment: Is the component of a control system which regulates the temperature of a system so that the system's temperature is maintained near a desired set point temperature
comment: Temperaturstyrt bryter @nb-no
comment: http://bsdd.buildingsmart.org/#concept/details/3MCWw0I6yHuO00025QrE$V
label: termostat @nb-no

Weather Station
type: Class
subclass of: Unitary Control Element
comment: a control element that senses multiple climate properties such as temperature, humidity, pressure, wind, and rain
comment: http://bsdd.buildingsmart.org/#concept/details/3d1EK0fY9CfwMNl1j5LmLc
label: værstasjon @nb-no

Unitary Equipment
type: Class
subclass of: Energy Conversion Device
comment: A combined of a number of components into a single product, such as air handlers, pre-packaged rooftop air-conditioning units, heat pumps, and split systems.
comment: http://bsdd.buildingsmart.org/#concept/details/0mUhAIpDb3mfYfYDW63M7U
label: Einbaufertige Anlage @de-de
label: Equipement unitaire @fr-fr
label: enhetlig utstyr @nb-no

Air Conditioning Unit
type: Class
subclass of: Unitary Equipment
comment: http://bsdd.buildingsmart.org/#concept/details/1PIU70CHzCMAt_h32UKgoE

Air Handler
type: Class
subclass of: Unitary Equipment
comment: http://bsdd.buildingsmart.org/#concept/details/1VnQL7ieb089ehb7syCaMo
label: luftbehandling @nb-no

Dehumidifier
type: Class
subclass of: Unitary Equipment
comment: a unitary packaged dehumidification unit. Note: units supporting multiple modes (dehumidification, cooling, and/or heating) should use AIRCONDITIONINGUNIT
comment: http://bsdd.buildingsmart.org/#concept/details/1fDG4loZb609HKaHBIkk_l
label: avfuktingsaggregat @nb-no

Rooftop Unit
type: Class
subclass of: Unitary Equipment
comment: http://bsdd.buildingsmart.org/#concept/details/0yMK$zpZz2Ahk9sfb3u4e7
comment: unitary systems manufactured in various configurations providing single or multi-zone heating, cooling, and ventilation.
label: takenhet @nb-no

Split System
type: Class
subclass of: Unitary Equipment
comment: http://bsdd.buildingsmart.org/#concept/details/2iiBgNKl10ifd$UgILMf64
label: delt system @nb-no

Valve
type: Class
subclass of: Flow Controller
comment: A flow control device used in a building services piping distribution system to control or modulate the flow of the fluid.
comment: An artefact used to control, i.e. permit, obstruct, regulate or divert a fluid stream.
comment: component isolating or controlling flow and pressure, e.g. isolating valve, control valve, pressure reducing valve, air valve, non-return valve, hydrant
comment: http://bsdd.buildingsmart.org/#concept/details/3s7E9HsSHBXejc$aKaBr8N
comment: komponent som isolerer eller kontrollerer vannføring og trykk, f.eks. stengeventil, kontrollventil, trykkreduksjonsventil, lufteventil, tilbakeslagsventil, brannventil/hydrant @nb-no
label: Absperrarmatur; Ventil @de-de
label: Afsluiter @nl-nl
label: Armatur @de-de
label: Vanne @fr-fr
label: Ventil @da
label: appareil de robinetterie @fr-fr
label: valve
label: vanne; valve @fr-fr
label: ventil @nb-no

Air Release
type: Class
subclass of: Valve
comment: http://bsdd.buildingsmart.org/#concept/details/3IEYICFuH8M9WXhUv2XVjI

Antivacuum
type: Class
subclass of: Valve
comment: http://bsdd.buildingsmart.org/#concept/details/3akkmqwTrDKhcl5Sgc6MbM

Change Over
type: Class
subclass of: Valve
comment: http://bsdd.buildingsmart.org/#concept/details/0EkRKqfjHD0PwOY11Ixaxp

Check
type: Class
subclass of: Valve
comment: http://bsdd.buildingsmart.org/#concept/details/39bvtEU9T7Kwb0mdT3F1M9

Commissioning
type: Class
subclass of: Valve
comment: http://bsdd.buildingsmart.org/#concept/details/3YmvYjeBXElRSJyWt903HE

Diverting
type: Class
subclass of: Valve
comment: http://bsdd.buildingsmart.org/#concept/details/0OsZoKWAP7BBEErvuwAY_x

DoubleCheck
type: Class
subclass of: Valve
comment: http://bsdd.buildingsmart.org/#concept/details/2$M2cKJh50r9iXgcDblZLB

Double Regulating
type: Class
subclass of: Valve
comment: http://bsdd.buildingsmart.org/#concept/details/2Y8s3cCGf3WAkyIwDxHfmt

Draw Off Cock
type: Class
subclass of: Valve
comment: http://bsdd.buildingsmart.org/#concept/details/1hIDIXF9r7MPfWQSquoEbq

Faucet
type: Class
subclass of: Valve
comment: http://bsdd.buildingsmart.org/#concept/details/2j7S2gFkr9VAAkDsk9ttBg

Flushing
type: Class
subclass of: Valve
comment: http://bsdd.buildingsmart.org/#concept/details/3tbXQW_znFmQVfKs3YhQZ_

Gas Cock
type: Class
subclass of: Valve
comment: http://bsdd.buildingsmart.org/#concept/details/0WwwuPsrfCgv8h5yWR3dKz

Gas Tap
type: Class
subclass of: Valve
comment: http://bsdd.buildingsmart.org/#concept/details/116lS7JG144hslqbHhbgkA

Isolating
type: Class
subclass of: Valve
comment: http://bsdd.buildingsmart.org/#concept/details/3fYepZO51AmflcVtRK9IVO

Mixing
type: Class
subclass of: Valve
comment: http://bsdd.buildingsmart.org/#concept/details/3cpFwtq7L1Owmcm7Yxvp05

Pressure Reducing
type: Class
subclass of: Valve
comment: http://bsdd.buildingsmart.org/#concept/details/1P7aHESGb1JxvdNIDc1D9J

Pressure Relief
type: Class
subclass of: Valve
comment: http://bsdd.buildingsmart.org/#concept/details/0Si_BQgDr7f8BoS$bMsnAA

Regulating
type: Class
subclass of: Valve
comment: http://bsdd.buildingsmart.org/#concept/details/2Y3yA_sy15NRRwfdI7LaxA

Safety Cut Off
type: Class
subclass of: Valve
comment: http://bsdd.buildingsmart.org/#concept/details/2cRQlX33L53gdVBEMFha9_

Steam Trap
type: Class
subclass of: Valve
comment: http://bsdd.buildingsmart.org/#concept/details/1IXcpzdwj4SgIc_5uXMgrX

Stop Cock
type: Class
subclass of: Valve
comment: http://bsdd.buildingsmart.org/#concept/details/0dmRan7HrB4v9gh4bkhOo3

Waste Terminal
type: Class
subclass of: Flow Terminal
comment: A terminal for the purpose of collecting or intercepting waste from one or more sanitary terminals or other fluid waste generating equipment and discharging it into a single waste/drainage system. Provides for all forms of trap and waste point that collects discharge from a sanitary terminal and discharges it into a waste/drainage subsystem or that collects waste from several terminals and passes it into a single waste/drainage subsystem. Includes the P and S traps from soil sanitary terminals, sinks, and basins as well as floor wastes and gully traps that provide collection points.
comment: http://bsdd.buildingsmart.org/#concept/details/3IXcC8tvn4igBk64SckDjX
label: Ablauf @de-de
label: Abscheider @de-de
label: Stockage des déchets @fr-fr
label: Vuilwaterput @nl-nl
label: avfallsterminal @nb-no

Floor Trap
type: Class
subclass of: Waste Terminal
comment: http://bsdd.buildingsmart.org/#concept/details/33CCzm2CLBDfHv1gHVU8MC

Floor Waste
type: Class
subclass of: Waste Terminal
comment: http://bsdd.buildingsmart.org/#concept/details/0Gg1lQtOn0jv4GqORpX2Y8

Gully Sump
type: Class
subclass of: Waste Terminal
comment: http://bsdd.buildingsmart.org/#concept/details/0ZMLzB3o99aurJi3RGmMhG

Gully Trap
type: Class
subclass of: Waste Terminal
comment: http://bsdd.buildingsmart.org/#concept/details/1WBoKi2av2NxTXpoB2QfO5
label: sluklås @nb-no

Roof Drain
type: Class
subclass of: Waste Terminal
comment: http://bsdd.buildingsmart.org/#concept/details/0Xkj0nlvX689aFUVxq3IMM
comment: pipe fitting, set into the roof, that collects rainwater for discharge into the rainwater system.
label: taksluk @nb-no

Waste Disposal Unit
type: Class
subclass of: Waste Terminal
comment: electrically operated device that reduces kitchen or other waste into fragments small enough to be flushed into a drainage system.
comment: http://bsdd.buildingsmart.org/#concept/details/0khvv6MsL5DxzEnCFiP5mr
label: avfallsenhet @nb-no

Waste Trap
type: Class
subclass of: Waste Terminal
comment: http://bsdd.buildingsmart.org/#concept/details/1JPv81z_531vDlQ02VFI9a
label: vannlås @nb-no

Pieter Pauwels
type: Person

Pieter Pauwels
type: Person

Pieter Pauwels
type: Person