catégorie d'âge
type: ObjectProperty
domain: Acteur
range: Catégorie d'âge
comment: Relation describing the link between an actor and the corresponding age category
comment: Relation décrivant le lien entre un acteur et la catégorie d'âge correspondante
label: age category @en

acteur associé
type: ObjectProperty
domain: Zone
range: Acteur
comment: Relation describing the link between a zone and the associated actor, which could be the occupant or any actor having a specific role associated to the zone @en
comment: Relation décrivant le lien entre une zone et un acteur associé, qui peut être l'occupant ou tout acteur ayant un rôle spécifique associé à cette zone
label: associated actor @en

zone associée
type: ObjectProperty
range: Zone
comment: Relation pouvant décrire le lien entre un occupant et une zone associée à travers le profile d'occupation ou tout simplement le lien entre un acteur en général et une zone pour laquelle il a un role spécifique
comment: Relation that can describe the link between an occupant and an associated zone through the occupation profile or simply the link between an actor in general and a zone for which he has a specific role @en
label: associated zone @en

politique énergétique
type: ObjectProperty
domain: Occupant
range: Politique énergétique
comment: Property linking an occupant to the energy policy that he adopts @en
comment: Propriété liant un occupant à la politique d'énergie qu'il adopte
label: energy policy @en
label: politica energetica @it
label: política energética @es

occupancy profile
type: ObjectProperty
domain: Occupant
range: Profile d'occupation
comment: Relation describing the link between an occupant and its occupancy profile associated to a particular zone @en
comment: Relation décrivant le lien entre un occupant et son profile d'occupation associé à une zone particulière
label: profile d'occupation

occupancy time
type: ObjectProperty
domain: Profile d'occupation
range: Intervalle de temps d'occupation
comment: Relation describing the link between an occupancy profile (associated to an occupant and a given zone) and the corresponding occupancy time range @en
comment: Relation décrivant le lien entre un profile d'occupation (associé à un occupant et une zone donnée) et l'intervalle d'occupation correspondant
label: temps d'occupation @en

situation de travail
type: ObjectProperty
domain: Occupant
range: Situation de travail
comment: Relation describing the link between an occupant and its work situation @en
comment: Relation décrivant le lien entre un occupant et la situation de travail correspondate
label: work situation @en

type de travail
type: ObjectProperty
domain: Situation de travail
range: Type de travail
comment: Relation describing the link between a work situation associated to an occupant and the corresponding work type @en
comment: Relation décrivant le lien entre la situation de travail associée à un occupant et le type de ce travail @en
label: work type @en

depuis date heure
type: DatatypeProperty
range: dateTime
comment: Property describing the start date and time related to an occupancy profile @en
comment: Propriété décrivant la date et l'heure de début liées à un profil d'occupation
label: from date time @en

income
type: DatatypeProperty
range: decimal
comment: Property describing the gross annual salary of an occupant @en
comment: Propriété décrivant le salaire annuel brut d'un occupant
comment: salaire

jusqu'au date heure
type: DatatypeProperty
range: dateTime
comment: Property describing the end date and time related to an occupancy profile @en
comment: Propriété décrivant la date et l'heure de fin liées à un profil d'occupation
label: to date time @en

Acteur
type: Class
subclass of: Restriction
  on property: catégorie d'âge
  max qualified cardinality: 1
  on class: Catégorie d'âge
comment: A building actor, which comes down to a building manager, a building owner or an occupant @en
comment: Un acteur du bâtiment, qui peut être un maître d'oeuvre, un maître d'ouvrage ou un occupant
label: Actor @en

Catégorie d'âge
type: Class
comment: Correspond à une classification selon les tranches d'ages de personnes
comment: Corresponds to a classification according to people age groups @en
label: Age category @en

Maître d'oeuvre
type: Class
subclass of: Acteur
disjoint with: Maître d'ouvrage
disjoint with: Occupant
comment: Person or entity chosen by the building owner for the operational management of the work @en
comment: Personne physique ou morale choisie par le maître d'ouvrage pour la conduite opérationnelle des travaux
label: Building manager @en

Maître d'ouvrage
type: Class
subclass of: Acteur
comment: Person or entity for whom the project is carried out @en
comment: Personne physique ou morale pour laquelle le projet est réalisé
label: Building owner @en

Politique énergétique
type: Class
equivalent class: Class
  one of: Confort
  one of: Eco-responsable
  one of: Eco-responsable++
comment: Defines to what extent the occupant pays attention to energy, and therefore has impacts on the heating or the use of certain devices during the simulation. @en
comment: Définit à quel point les occupants font attention ou non à l’énergie, et donc ont des impacts sur le chauffage ou l’utilisation de certains appareils durant la simulation.
label: Energy policy @en
label: Politica energetica @it
label: Política energética @es

Profile d'occupation
type: Class
subclass of: Restriction
  on property: occupancy time
  all values from: Intervalle de temps d'occupation
subclass of: Restriction
  on property: zone associée
  max qualified cardinality: 1
  on class: Zone
comment: An occupancy profile describes some useful occupancy information (e.g., the occupancy time range) related to an occuppant associated to a given zone @en
comment: Le profil d'occupation décrit certaines informations utiles (par exemple,les intervales d'occupation) liées à un occupant pour une zone donnée
label: Occupancy profile @en

Intervalle de temps d'occupation
type: Class
subclass of: Restriction
  on property: depuis date heure
  all values from: dateTime
subclass of: Restriction
  on property: jusqu'au date heure
  all values from: dateTime
comment: L'intervalle de temps d'occupation lié à un occupant et une zone donnée
comment: The occupancy time range related to an occupant and a given area @en
label: Occupancy time range @en

Occupant
type: Class
subclass of: Acteur
subclass of: Restriction
  on property: occupancy profile
  all values from: Profile d'occupation
subclass of: Restriction
  on property: situation de travail
  all values from: Situation de travail
comment: A type of actor that defines the form of occupancy of a property @en
comment: Un type d'acteur qui définit la forme d'occupation d'une propriété

Situation de travail
type: Class
subclass of: Restriction
  on property: type de travail
  all values from: Type de travail
subclass of: Restriction
  on property: income
  all values from: decimal
comment: Describes the work situation of an occupant, mainly the type of work (if any), and its related income @en
comment: Décrit la situation de travail d'un occupant, principalement le type de travail (le cas échéant) et son revenu
label: Work situation @en

Type de travail
type: Class
equivalent class: Class
  one of: Employé
  one of: Travailleur indépendant
  one of: sans emploi
comment: Describes the occupant type of work @en
comment: Décrit le type de travail d'un occupant
label: Work type @en

Adulte
type: NamedIndividual
type: Catégorie d'âge
comment: An adult is a person aged between 18 and 64 inclusive @en
comment: Un adulte est une personne âgée antre 18 et 64 ans inclus
label: Adult @en

Bébé
type: NamedIndividual
type: Catégorie d'âge
comment: A baby is a person who is less than a year old @en
comment: Un bébé est une personne qui a moins d'un an
label: Baby @en

Enfant
type: NamedIndividual
type: Catégorie d'âge
comment: A child is a person aged between 1 year and 11 years inclusive @en
comment: Un enfant est une personne âgée entre 1 an et 11 ans inclus
label: Child @en

Confort
type: NamedIndividual
type: Politique énergétique
comment: An occupant who is not eco friendly @en
comment: Un occupant qui n'est pas éco-responsable
label: Comfort @en
label: Comodidad @es
label: Comodità @it

Eco-responsable
type: NamedIndividual
type: Politique énergétique
comment: An occupant who is eco friendly @en
comment: Un occupant éco-responsable
label: Eco friendly @en
label: Ecológico @es

Eco-responsable++
type: NamedIndividual
type: Politique énergétique
comment: An occupant who is eco friendly++ @en
comment: Un occupant éco-responsable++
label: Eco friendly++ @en
label: Ecológico++ @es

Personne âgée
type: NamedIndividual
type: Catégorie d'âge
comment: An elderly is a person aged 65 and over @en
comment: Un personne âgée est une personne qui a 65 ans et plus
label: Elderly @en

Employé
type: NamedIndividual
type: Type de travail
comment: An occupant having a paid job @en
comment: Un occupant ayant un emploi rémunéré
label: Employed @en

Travailleur indépendant
type: NamedIndividual
type: Type de travail
comment: An occupant who is working for oneself as a freelance or who is the owner of a business @en
comment: Un occupant qui travaille pour soi-même en tant que freelance ou qui est le propriétaire d'une entreprise
label: Self employed @en

Adolescent
type: NamedIndividual
type: Catégorie d'âge
comment: A teenager is a person aged between 12 and 17 years inclusive @en
comment: Un adolescent est une personne âgée entre 12 et 17 ans inclus
label: Teenager @en

sans emploi
type: NamedIndividual
type: Type de travail
comment: An occupant without a paid job @en
comment: Un occupant sans emploi
label: Unemployed @en