afkorting
type: AnnotationProperty
preferred label: abbreviation @en
sub property of: altLabel
range: string

begint
type: ObjectProperty
domain: gebeurtenis
range: activiteit
definition: Deze relatie geldt tussen een Gebeurtenis en een Toestand.
definition: This relationship applies between an Event and a State. @en
example: De blikseminslag (gebeurtenis) is het begin van de bosbrand (toestand).
example: The lightning strike (event) is the start of the forest fire (state). @en
preferred label: begins @en

beschrijft
type: ObjectProperty
domain: informatieobject
range: Class
  union of: activiteit
  union of: gebeurtenis
  union of: informatieobject
  union of: fysiek object
  union of: toestand
definition: Deze relatie geldt tussen een Informatie Object en een Fysiek Object, een Activiteit, een Gebeurtenis, een Toestand, een Tijdperiode, een Ruimtelijk Gebied of een ander Informatie Object.
definition: This relationship applies between an Information Object and a Physical Object, an Activity, an Event, a State, a Time Period, a Spatial Region or another Information Object. @en
example: Neem de Ketelbrug. Daar is in de loop der tijden een waar dossier ontstaan van tekeningen, specificaties, rapporten, nota's, in analoge of in digitale vorm. Elk van deze documenten beschrijft de Ketelbrug en kan worden gezien als een instantie van een Informatie Object die de Ketelbrug beschrijft.
example: Take the Ketel bridge. Over time, a dossier has been created of drawings, specifications, reports, invoices, in analogue or in digital form. Each of these documents describes the Ketelbrug and can be seen as an instance of an Information Object that describes the Ketelbrug. @en
preferred label: describes @en

beeindigt
type: ObjectProperty
domain: gebeurtenis
range: activiteit
definition: Deze relatie geldt tussen een Gebeurtenis en een Toestand.
definition: This relationship applies between an Event and a State. @en
example: Het onweer (gebeurtenis) beeindigde het mooie weer (toestand).
example: The thunderstorm (event) ended the nice weather (state). @en
preferred label: ends @en

heeft begrenzing
type: ObjectProperty
domain: Class
  union of: activiteit
  union of: fysiek object
range: ruimtelijk gebied
definition: Deze relatie geldt tussen een Fysiek Object en een Ruimtelijk Gebied.
definition: This relationship applies between a Physical Object and a Spatial Region. @en
example: A parcel is bounded by a 1D GML polyline. @en
example: Een perceel wordt begrensd door een 1D GML polyline.
preferred label: has boundary @en

heeft inwendige
type: ObjectProperty
domain: Class
  union of: activiteit
  union of: fysiek object
range: ruimtelijk gebied
definition: Deze relatie geldt tussen een Fysiek Object en een (topologisch) Ruimtelijk Gebied, tussen een Activiteit en een Ruimtelijk Gebied en tussen een Toestand en een Ruimtelijk Gebied.
definition: This relationship applies between a Physical Object and a (topological) Spatial Region, between an Activity and a Spatial Region and between a State and a Spatial Region. @en
example: An IfcSpace as physical space can have a Constructive Solid Geometry (CSG) representation as a special case of a 3D region in space.
example: Een IfcSpace als fysieke ruimte kan een Constructive Solid Geometry (CSG) representatie hebben als speciaal geval van een 3D ruimtelijk gebied.
preferred label: has interior @en

heeft deel
type: ObjectProperty
definition: Deze relatie, zoals al generiek geintroduceerd in de CMM, geldt tussen Fysiek Objecten onderling, tussen Informatie Objecten onderling of tussen Activiteiten onderling.
definition: This relationship, as already generically introduced in the CMM, applies between Physical Objects themselves, between Information Objects themselves or between Activities themselves. @en
example: De fiets van Ellen (fysiek object) bestaat uit een frame, twee wielen en diverse andere onderdelen (allen fysieke objecten).
example: Ellen's bicycle (physical object) consists of a frame, two wheels and various other parts (all physical objects). @en
preferred label: has part @en

heeft periode
type: ObjectProperty
domain: Class
  union of: activiteit
  union of: fysiek object
range: temporeel gebied
definition: Deze relatie geldt tussen een Toestand en een Tijdperiode of tussen een Fysiek Object en een Tijdperiode.
definition: This relationship applies between a Condition and a Time Period or between a Physical Object and a Time Period. @en
example: From Friday 26 July up to and including Sunday 18 August 2019 (time period) the N231 (physical object) is completely closed off (condition) due to major maintenance (activity). @en
example: Van vrijdag 26 juli tot en met zondag 18 augustus 2019 (tijdperiode) is de N231 (fysiek object) volledig afgesloten (toestand) vanwege groot onderhoud (activiteit).
preferred label: has period @en

heeft ruimtelocatie
type: ObjectProperty
domain: ruimtelijk gebied
range: ruimtelocatie
preferred label: has spatial location @en

heeft ruimtereferentie
type: ObjectProperty
domain: ruimtelocatie
range: ruimtereferentie
preferred label: has spatial reference @en

heeft ruimtereferentiesysteem
type: ObjectProperty
domain: ruimtelocatie
range: ruimtereferentiesysteem
preferred label: has spatial reference system @en

heeft toestand
type: ObjectProperty
domain: Class
  union of: activiteit
  union of: fysiek object
range: toestand
definition: Deze relatie geldt tussen een Activiteit en een Toestand of tussen een Fysiek Object en een Toestand.
definition: This relationship applies between an Activity and a State or between a Physical Object and a State. @en
example: A state can contain multiple parameters. In this way, the air pressure, temperature and humidity of a piece of atmosphere can be recorded. These three parameters then define the state of the atmosphere at a certain location and time. @en
example: Een toestand kan meerdere parameters bevatten. Zo kan van een stukje atmosfeer zowel de luchtdruk, temperatuur als de luchtvochtigheid worden vastgelegd. Deze drie parameters definieren dan de toestand van de atmosfeer op een bepaalde locatie en een bepaald tijdstip.
preferred label: has state @en

heeft tijdlocatie
type: ObjectProperty
domain: temporeel gebied
range: tijdlocatie
preferred label: has temporal location @en

heeft tijdreferentie
type: ObjectProperty
domain: tijdlocatie
range: tijdreferentie
preferred label: has temporal reference @en

heeft tijdreferentiesysteem
type: ObjectProperty
domain: tijdlocatie
range: tijdreferentiesysteem
preferred label: has temporal reference system @en

voert uit
type: ObjectProperty
domain: fysiek object
range: activiteit
definition: Deze relatie geldt tussen een Fysiek Object en een Activiteit.
definition: This relationship applies between a Physical Object and an Activity. @en
example: Het Lassen van een brugleuning (een activiteit) wordt uitgevoerd met behulp van een Lasapparaat (fysiek object) en de Lasser (fysiek object).
example: The welding of a bridge railing (an activity) is carried out with the aid of a welding machine (physical object) and the welder (physical object). @en
preferred label: performs @en

grootheid
type: ObjectProperty
range: QuantityKind
preferred label: quantity kind @en

transformeert
type: ObjectProperty
domain: activiteit
range: fysiek object
definition: Deze relatie geldt tussen een Activiteit en een Fysiek Object of tussen een Activiteit en een Informatie Object.
definition: This relationship applies between an Activity and a Physical Object or between an Activity and an Information Object. @en
example: Baking (an activity) transforms a pizza (a physical object) from unbaked (a state) to baked (another state). @en
example: Het Bakken (een activiteit) transformeert een pizza (een fysiek object) van ongebakken (een toestand) naar gebakken (een andere toestand).
preferred label: transforms @en

triggert
type: ObjectProperty
domain: Class
  union of: activiteit
  union of: fysiek object
range: gebeurtenis
definition: Deze relatie geldt tussen een Gebeurtenis en een Activiteit en een Gebeurtenis en een Fysiek Object.
definition: This relationship applies between an Event and an Activity and an Event and a Physical Object. @en
example: Neem een Verkeersongeval (een gebeurtenis). Deze initieert de komst van de hulpdiensten (een activiteit).
example: Take a traffic accident (an event). This initiates the arrival of the emergency services (an activity). @en
preferred label: triggers @en

eenheid
type: ObjectProperty
range: Unit
preferred label: unit @en

activiteit
type: Class
subclass of: Thing
subclass of: Restriction
  on property: heeft deel
  all values from: activiteit
definition: An activity is something possibly or actual happens in space and time
example: Fluid pressure measurement, driving a car are examples of an <activity>
preferred label: activity @en
scope note: Process, function, human activity, machine activity, task, procedure, project are subclasses of <Activity>.

adressysteem
type: Class
subclass of: ruimtereferentiesysteem
preferred label: address system @en

kalendersysteem
type: Class
subclass of: tijdreferentiesysteem
preferred label: calendar system @en

coordinaatreferentiesysteem
type: Class
subclass of: ruimtereferentiesysteem
preferred label: coordinate reference system @en

enumeratietype
type: Class
subclass of: Thing
definition: The superclass of all user-defined enumeration classes where the allowed enumeration items are individuals
example: LoadLevelType being Low, Medium or High
preferred label: enumeration type @en

gebeurtenis
type: Class
subclass of: Thing
definition: A thing that happens or takes place and marks the beginning or ending of an activity or state
example: The connection of power to pump P_101, the take-off of a aeroplane are examples of an <Event>.
preferred label: event @en
scope note: Transition, cause, effect, risk, milestone, issue, accident, point in time are subclasses of <Event>.

index bekende ruimtelijke plaatsen
type: Class
subclass of: ruimtereferentiesysteem
preferred label: index known spatial locations @en

informatieobject
type: Class
subclass of: Thing
subclass of: Restriction
  on property: heeft deel
  all values from: informatieobject
definition: Thing that is a whole of information on itself and has an own identity
example: a file within a computer system, the PDF file with URI http://material-certificate/M-101-1234.pdf are examples of <InformationObject>
preferred label: information object @en
scope note: Requirement, document, statement, E-mail, code, identifier are subclasses of <InformationObject> .

lineair referentiesysteem
type: Class
subclass of: ruimtereferentiesysteem
preferred label: linear reference system @en

fysiek object
type: Class
subclass of: Thing
subclass of: Restriction
  on property: heeft deel
  all values from: fysiek object
definition: Is something that possibly or actually exists in space and time, perceivable through the senses
example: Pump P_101, a single living organism are examples of a <PhysicalObject>
preferred label: physical object @en
scope note: Artefact, matter, person, organisation, stream, connection are subclasses of <PhysicalObject>.

kwantiteitwaarde
type: Class
subclass of: Error31
subclass of: Thing
preferred label: quantity value @en

ruimtelocatie
type: Class
subclass of: Thing
preferred label: spatial location @en

ruimtereferentie
type: Class
subclass of: Thing
preferred label: spatial reference @en

ruimtereferentiesysteem
type: Class
subclass of: Thing
preferred label: spatial reference system @en

ruimtelijk gebied
type: Class
subclass of: Thing
definition: Demarcated space
example: an IFC BREP or GeoSPARQL geometry representing a physical space, as special case of a physical object, such as an office space, a construction area for a building, a maritime traffic zone within the Channel, a hazard zone within a plant or the loading gauge of a train are examples of a <SpatialRegion>
preferred label: spatial region @en

toestand
type: Class
subclass of: Thing
definition: A particular condition that something is in during a specific period in time
example: well-functioning of a car, the condition of an elevator of being un-safe are examples of a <State>
preferred label: state @en
scope note: Condition, failure state, objective are subclasses of <State>.

tijdcoordinaatreferentiesysteem
type: Class
subclass of: tijdreferentiesysteem
preferred label: temporal coordinate reference system @en

tijdlocatie
type: Class
subclass of: Thing
preferred label: temporal location @en

tijdreferentie
type: Class
subclass of: Thing
preferred label: temporal reference @en

tijdreferentiesysteem
type: Class
preferred label: temporal reference system @en

temporeel gebied
type: Class
subclass of: Thing
definition: A length or portion of time
example: week 12 in 2019, design stage of the Schiphol tunnel are examples of a <TemporalRegion>
preferred label: temporal region @en
scope note: Week, day, life cycle stage are subclasses of <TemporalRegion>.

qualified cardinality: 1